﻿2026-07-29T09:50:21.1839526Z ##[group]Run cargo test --workspace --lib --bins
2026-07-29T09:50:21.1840075Z [36;1mcargo test --workspace --lib --bins[0m
2026-07-29T09:50:21.1848375Z shell: C:\Program Files\PowerShell\7\pwsh.EXE -command ". '{0}'"
2026-07-29T09:50:21.1848818Z ##[endgroup]
2026-07-29T09:50:26.7387778Z    Compiling proc-macro2 v1.0.106
2026-07-29T09:50:26.7388241Z    Compiling quote v1.0.45
2026-07-29T09:50:26.7388543Z    Compiling unicode-ident v1.0.24
2026-07-29T09:50:26.7388887Z    Compiling cfg-if v1.0.4
2026-07-29T09:50:26.7389246Z    Compiling serde_core v1.0.228
2026-07-29T09:50:26.7389755Z    Compiling serde v1.0.228
2026-07-29T09:50:26.7390121Z    Compiling windows-link v0.2.1
2026-07-29T09:50:26.7390453Z    Compiling portable-atomic v1.13.1
2026-07-29T09:50:26.7390807Z    Compiling typenum v1.20.1
2026-07-29T09:50:26.7391112Z    Compiling getrandom v0.3.4
2026-07-29T09:50:26.7393655Z    Compiling version_check v0.9.5
2026-07-29T09:50:26.7395269Z    Compiling critical-section v1.2.0
2026-07-29T09:50:26.7395762Z    Compiling find-msvc-tools v0.1.9
2026-07-29T09:50:26.7416014Z    Compiling shlex v2.0.1
2026-07-29T09:50:26.7417658Z    Compiling memchr v2.8.1
2026-07-29T09:50:26.7420234Z    Compiling subtle v2.6.1
2026-07-29T09:50:26.8739088Z    Compiling windows-sys v0.61.2
2026-07-29T09:50:26.9178519Z    Compiling equivalent v1.0.2
2026-07-29T09:50:26.9946329Z    Compiling smallvec v1.15.1
2026-07-29T09:50:27.0616643Z    Compiling semver v1.0.28
2026-07-29T09:50:27.2158145Z    Compiling itoa v1.0.18
2026-07-29T09:50:27.2417566Z    Compiling pin-project-lite v0.2.17
2026-07-29T09:50:27.3039543Z    Compiling rand_core v0.10.1
2026-07-29T09:50:27.3720316Z    Compiling generic-array v0.14.7
2026-07-29T09:50:27.5063332Z    Compiling rustc_version v0.4.1
2026-07-29T09:50:27.5314342Z    Compiling getrandom v0.4.2
2026-07-29T09:50:27.5826811Z    Compiling getrandom v0.2.17
2026-07-29T09:50:27.6419659Z    Compiling cpufeatures v0.2.17
2026-07-29T09:50:27.6525381Z    Compiling hashbrown v0.17.1
2026-07-29T09:50:27.8406962Z    Compiling futures-core v0.3.32
2026-07-29T09:50:27.9820604Z    Compiling bytes v1.11.1
2026-07-29T09:50:28.0848005Z    Compiling stable_deref_trait v1.2.1
2026-07-29T09:50:28.0870971Z    Compiling log v0.4.32
2026-07-29T09:50:28.1218124Z    Compiling futures-io v0.3.32
2026-07-29T09:50:28.1407296Z    Compiling futures-sink v0.3.32
2026-07-29T09:50:28.1434046Z    Compiling slab v0.4.12
2026-07-29T09:50:28.1721937Z    Compiling futures-task v0.3.32
2026-07-29T09:50:28.2340043Z    Compiling rustversion v1.0.22
2026-07-29T09:50:28.3882348Z    Compiling jobserver v0.1.34
2026-07-29T09:50:28.4127120Z    Compiling futures-channel v0.3.32
2026-07-29T09:50:28.4246578Z    Compiling bitflags v2.12.1
2026-07-29T09:50:28.4945762Z    Compiling libc v0.2.186
2026-07-29T09:50:28.4946572Z    Compiling winapi v0.3.9
2026-07-29T09:50:28.4946853Z    Compiling fnv v1.0.7
2026-07-29T09:50:28.5054039Z    Compiling autocfg v1.5.1
2026-07-29T09:50:28.5325072Z    Compiling strsim v0.11.1
2026-07-29T09:50:28.7321686Z    Compiling cc v1.2.63
2026-07-29T09:50:28.7380762Z    Compiling indexmap v2.14.0
2026-07-29T09:50:28.8744202Z    Compiling cfg_aliases v0.2.1
2026-07-29T09:50:28.9016205Z    Compiling curve25519-dalek v4.1.3
2026-07-29T09:50:28.9054364Z    Compiling zerocopy v0.8.50
2026-07-29T09:50:29.0614405Z    Compiling syn v2.0.117
2026-07-29T09:50:29.1039427Z    Compiling writeable v0.6.3
2026-07-29T09:50:29.1437661Z    Compiling crypto-common v0.1.7
2026-07-29T09:50:29.2683326Z    Compiling block-buffer v0.10.4
2026-07-29T09:50:29.3073437Z    Compiling litemap v0.8.2
2026-07-29T09:50:29.3109584Z    Compiling rand_core v0.6.4
2026-07-29T09:50:29.3577585Z    Compiling ahash v0.8.12
2026-07-29T09:50:29.3608610Z    Compiling ident_case v1.0.1
2026-07-29T09:50:29.4350138Z    Compiling dunce v1.0.5
2026-07-29T09:50:29.5039206Z    Compiling digest v0.10.7
2026-07-29T09:50:29.5739337Z    Compiling icu_normalizer_data v2.2.0
2026-07-29T09:50:29.6397294Z    Compiling icu_properties_data v2.2.0
2026-07-29T09:50:29.6839341Z    Compiling utf8_iter v1.0.4
2026-07-29T09:50:29.7850523Z    Compiling cmake v0.1.58
2026-07-29T09:50:29.8325633Z    Compiling fs_extra v1.3.0
2026-07-29T09:50:29.8377482Z    Compiling uuid v1.23.2
2026-07-29T09:50:29.8724782Z    Compiling sha2 v0.10.9
2026-07-29T09:50:29.9411634Z    Compiling signature v2.2.0
2026-07-29T09:50:30.0969978Z    Compiling pkg-config v0.3.33
2026-07-29T09:50:30.2399078Z    Compiling zmij v1.0.21
2026-07-29T09:50:30.2472082Z    Compiling vcpkg v0.2.15
2026-07-29T09:50:30.3288684Z    Compiling ed25519 v2.2.3
2026-07-29T09:50:30.3751480Z    Compiling percent-encoding v2.3.2
2026-07-29T09:50:30.3767715Z    Compiling serde_json v1.0.150
2026-07-29T09:50:30.5641514Z    Compiling fastrand v2.4.1
2026-07-29T09:50:30.6222180Z    Compiling http v1.4.1
2026-07-29T09:50:30.6958220Z    Compiling cpufeatures v0.3.0
2026-07-29T09:50:30.6958791Z    Compiling aws-lc-rs v1.17.0
2026-07-29T09:50:30.7215850Z    Compiling windows_x86_64_msvc v0.52.6
2026-07-29T09:50:30.7563425Z    Compiling thiserror v2.0.18
2026-07-29T09:50:30.8995693Z    Compiling aws-lc-sys v0.41.0
2026-07-29T09:50:30.9035862Z    Compiling ring v0.17.14
2026-07-29T09:50:30.9226103Z    Compiling unicode-segmentation v1.13.3
2026-07-29T09:50:30.9307242Z    Compiling fallible-streaming-iterator v0.1.9
2026-07-29T09:50:31.2082053Z    Compiling scopeguard v1.2.0
2026-07-29T09:50:31.3403118Z    Compiling fallible-iterator v0.3.0
2026-07-29T09:50:31.3926291Z    Compiling chacha20 v0.10.0
2026-07-29T09:50:31.4237439Z    Compiling form_urlencoded v1.2.2
2026-07-29T09:50:31.4678689Z    Compiling libsqlite3-sys v0.30.1
2026-07-29T09:50:31.5988007Z    Compiling lock_api v0.4.14
2026-07-29T09:50:31.6659672Z    Compiling untrusted v0.9.0
2026-07-29T09:50:31.8108859Z    Compiling windows-targets v0.52.6
2026-07-29T09:50:31.8528609Z    Compiling rand v0.10.1
2026-07-29T09:50:31.8529019Z    Compiling num-traits v0.2.19
2026-07-29T09:50:31.8686144Z    Compiling windows-strings v0.5.1
2026-07-29T09:50:31.9225723Z    Compiling windows-result v0.4.1
2026-07-29T09:50:32.0177963Z    Compiling anyhow v1.0.102
2026-07-29T09:50:32.1076010Z    Compiling fs2 v0.4.3
2026-07-29T09:50:32.1247317Z    Compiling rustls v0.23.40
2026-07-29T09:50:32.2165655Z    Compiling heck v0.5.0
2026-07-29T09:50:32.2228610Z    Compiling windows-sys v0.59.0
2026-07-29T09:50:32.5208978Z    Compiling convert_case v0.10.0
2026-07-29T09:50:32.5554883Z    Compiling const-oid v0.10.2
2026-07-29T09:50:32.5887171Z    Compiling unicode-xid v0.2.6
2026-07-29T09:50:32.5900231Z    Compiling atomic-waker v1.1.2
2026-07-29T09:50:32.5901523Z    Compiling parking_lot_core v0.9.12
2026-07-29T09:50:32.8737465Z    Compiling httparse v1.10.1
2026-07-29T09:50:33.2815991Z    Compiling synstructure v0.13.2
2026-07-29T09:50:33.3220692Z    Compiling darling_core v0.20.11
2026-07-29T09:50:33.4219552Z    Compiling http-body v1.0.1
2026-07-29T09:50:33.6164468Z    Compiling hybrid-array v0.4.12
2026-07-29T09:50:33.6843964Z    Compiling either v1.16.0
2026-07-29T09:50:33.7266307Z    Compiling powerfmt v0.2.0
2026-07-29T09:50:33.9878334Z    Compiling base64ct v1.8.3
2026-07-29T09:50:34.0497179Z    Compiling deranged v0.5.8
2026-07-29T09:50:34.2888747Z    Compiling tower-service v0.3.3
2026-07-29T09:50:34.3565334Z    Compiling pem-rfc7468 v1.0.0
2026-07-29T09:50:34.3565888Z    Compiling ref-cast v1.0.25
2026-07-29T09:50:34.4093368Z    Compiling num-conv v0.2.2
2026-07-29T09:50:34.4827119Z    Compiling base64 v0.22.1
2026-07-29T09:50:34.5204378Z    Compiling try-lock v0.2.5
2026-07-29T09:50:34.5529274Z    Compiling time-core v0.1.8
2026-07-29T09:50:34.5619685Z    Compiling tinyvec_macros v0.1.1
2026-07-29T09:50:34.6051272Z    Compiling data-encoding v2.11.0
2026-07-29T09:50:34.6851071Z    Compiling want v0.3.1
2026-07-29T09:50:34.7414761Z    Compiling tinyvec v1.11.0
2026-07-29T09:50:34.7893732Z    Compiling parking_lot v0.12.5
2026-07-29T09:50:34.7894456Z    Compiling crypto-common v0.2.2
2026-07-29T09:50:34.8352545Z    Compiling block-buffer v0.12.0
2026-07-29T09:50:34.8867065Z    Compiling serde_derive_internals v0.29.1
2026-07-29T09:50:34.9088485Z    Compiling vergen-lib v9.1.0
2026-07-29T09:50:35.0373784Z    Compiling inout v0.1.4
2026-07-29T09:50:35.1260071Z    Compiling n0-future v0.3.2
2026-07-29T09:50:35.2060789Z    Compiling aho-corasick v1.1.4
2026-07-29T09:50:35.2681729Z    Compiling toml_write v0.1.2
2026-07-29T09:50:35.2682581Z    Compiling winnow v0.7.15
2026-07-29T09:50:35.4306825Z    Compiling httpdate v1.0.3
2026-07-29T09:50:35.5394782Z    Compiling spin v0.10.0
2026-07-29T09:50:35.5636851Z    Compiling regex-syntax v0.8.10
2026-07-29T09:50:35.5637352Z    Compiling diatomic-waker v0.2.3
2026-07-29T09:50:35.5935991Z    Compiling crossbeam-utils v0.8.21
2026-07-29T09:50:35.6794579Z    Compiling parking v2.2.1
2026-07-29T09:50:35.7620496Z    Compiling cordyceps v0.3.4
2026-07-29T09:50:35.8668781Z    Compiling winnow v1.0.3
2026-07-29T09:50:35.9159279Z    Compiling futures-lite v2.6.1
2026-07-29T09:50:36.0158616Z    Compiling digest v0.11.3
2026-07-29T09:50:36.1134374Z    Compiling futures-buffered v0.2.13
2026-07-29T09:50:36.1165638Z    Compiling socket2 v0.6.4
2026-07-29T09:50:36.1629398Z    Compiling mio v1.2.1
2026-07-29T09:50:36.2859272Z    Compiling serde_derive v1.0.228
2026-07-29T09:50:36.3746987Z    Compiling zeroize_derive v1.4.3
2026-07-29T09:50:36.4465235Z    Compiling zerofrom-derive v0.1.7
2026-07-29T09:50:36.5825954Z    Compiling yoke-derive v0.8.2
2026-07-29T09:50:36.6604063Z    Compiling tokio-macros v2.7.0
2026-07-29T09:50:36.7719496Z    Compiling curve25519-dalek-derive v0.1.1
2026-07-29T09:50:36.8123396Z    Compiling futures-macro v0.3.32
2026-07-29T09:50:36.9319026Z    Compiling zerovec-derive v0.11.3
2026-07-29T09:50:37.2381583Z    Compiling displaydoc v0.2.6
2026-07-29T09:50:37.5385448Z    Compiling tracing-attributes v0.1.31
2026-07-29T09:50:37.5874334Z    Compiling zeroize v1.8.2
2026-07-29T09:50:37.6402313Z    Compiling tokio v1.52.3
2026-07-29T09:50:37.6457379Z    Compiling thiserror-impl v2.0.18
2026-07-29T09:50:37.7343073Z    Compiling darling_macro v0.20.11
2026-07-29T09:50:37.8961001Z    Compiling futures-util v0.3.32
2026-07-29T09:50:38.3580508Z    Compiling rustls-pki-types v1.14.1
2026-07-29T09:50:38.6394947Z    Compiling derive_more-impl v2.1.1
2026-07-29T09:50:38.6602064Z    Compiling windows-implement v0.60.2
2026-07-29T09:50:38.7677192Z    Compiling windows-interface v0.59.3
2026-07-29T09:50:38.8561747Z    Compiling spez v0.1.2
2026-07-29T09:50:38.9752928Z    Compiling zerofrom v0.1.8
2026-07-29T09:50:39.1114391Z    Compiling darling v0.20.11
2026-07-29T09:50:39.1896118Z    Compiling n0-error-macros v0.1.3
2026-07-29T09:50:39.2781418Z    Compiling yoke v0.8.3
2026-07-29T09:50:39.2875338Z    Compiling der v0.8.0-rc.10
2026-07-29T09:50:39.7384570Z    Compiling ed25519-dalek v2.2.0
2026-07-29T09:50:39.7883240Z    Compiling derive_builder_core v0.20.2
2026-07-29T09:50:39.8221292Z    Compiling zerovec v0.11.6
2026-07-29T09:50:39.8274878Z    Compiling zerotrie v0.2.4
2026-07-29T09:50:39.8847024Z    Compiling windows-core v0.62.2
2026-07-29T09:50:40.1720504Z    Compiling spt-proto v0.45.0 (C:\actions-runner\_work\spt-bs-core\spt-bs-core\crates\spt-proto)
2026-07-29T09:50:40.1810948Z    Compiling ref-cast-impl v1.0.25
2026-07-29T09:50:40.2025534Z    Compiling pin-project-internal v1.1.13
2026-07-29T09:50:40.4338305Z    Compiling regex-automata v0.4.14
2026-07-29T09:50:40.6310572Z    Compiling tinystr v0.8.3
2026-07-29T09:50:40.6311050Z    Compiling potential_utf v0.1.5
2026-07-29T09:50:40.8824653Z    Compiling icu_locale_core v2.2.0
2026-07-29T09:50:40.9160284Z    Compiling icu_collections v2.2.0
2026-07-29T09:50:40.9664150Z    Compiling n0-error v0.1.3
2026-07-29T09:50:40.9664579Z    Compiling spki v0.8.0-rc.4
2026-07-29T09:50:41.2320509Z    Compiling derive_builder_macro v0.20.2
2026-07-29T09:50:41.3127473Z    Compiling toml_parser v1.1.2+spec-1.1.0
2026-07-29T09:50:41.3330737Z    Compiling schemars_derive v1.2.1
2026-07-29T09:50:41.8128917Z    Compiling cipher v0.4.4
2026-07-29T09:50:41.8167423Z    Compiling derive_builder v0.20.2
2026-07-29T09:50:41.8975771Z    Compiling icu_provider v2.2.0
2026-07-29T09:50:41.9739641Z    Compiling ipnet v2.12.0
2026-07-29T09:50:41.9964937Z    Compiling serde_spanned v0.6.9
2026-07-29T09:50:42.1278912Z    Compiling toml_datetime v0.6.11
2026-07-29T09:50:42.2403610Z    Compiling tokio-util v0.7.18
2026-07-29T09:50:42.2404092Z    Compiling icu_normalizer v2.2.0
2026-07-29T09:50:42.2441912Z    Compiling icu_properties v2.2.0
2026-07-29T09:50:42.2755685Z    Compiling pin-project v1.1.13
2026-07-29T09:50:42.2757193Z    Compiling vergen-lib v0.1.6
2026-07-29T09:50:42.4865468Z    Compiling toml_edit v0.22.27
2026-07-29T09:50:42.5824383Z    Compiling once_cell v1.21.4
2026-07-29T09:50:42.6085428Z    Compiling vergen v9.1.0
2026-07-29T09:50:42.6462025Z    Compiling universal-hash v0.5.1
2026-07-29T09:50:42.7830804Z    Compiling noq-udp v0.10.0
2026-07-29T09:50:42.8247324Z    Compiling sync_wrapper v1.0.2
2026-07-29T09:50:42.8247863Z    Compiling curve25519-dalek v5.0.0-pre.6
2026-07-29T09:50:42.8846212Z    Compiling heapless v0.7.17
2026-07-29T09:50:42.9831111Z    Compiling tracing-core v0.1.36
2026-07-29T09:50:43.0254303Z    Compiling opaque-debug v0.3.1
2026-07-29T09:50:43.0614844Z    Compiling byteorder v1.5.0
2026-07-29T09:50:43.1604654Z    Compiling toml_datetime v1.1.1+spec-1.1.0
2026-07-29T09:50:43.2694985Z    Compiling hashbrown v0.14.5
2026-07-29T09:50:43.3496170Z    Compiling dyn-clone v1.0.20
2026-07-29T09:50:43.3682200Z    Compiling allocator-api2 v0.2.21
2026-07-29T09:50:43.3966154Z    Compiling tracing v0.1.44
2026-07-29T09:50:43.5229064Z    Compiling idna_adapter v1.2.2
2026-07-29T09:50:43.5708564Z    Compiling toml_edit v0.25.12+spec-1.1.0
2026-07-29T09:50:43.7224821Z    Compiling hash32 v0.2.1
2026-07-29T09:50:43.7777857Z    Compiling polyval v0.6.2
2026-07-29T09:50:43.8316438Z    Compiling idna v1.1.0
2026-07-29T09:50:43.8725387Z    Compiling schemars v1.2.1
2026-07-29T09:50:43.9003553Z    Compiling derive_more v2.1.1
2026-07-29T09:50:43.9317521Z    Compiling h2 v0.4.14
2026-07-29T09:50:43.9640328Z    Compiling hashlink v0.9.1
2026-07-29T09:50:44.0778541Z    Compiling regex v1.12.3
2026-07-29T09:50:44.1037450Z    Compiling prefix-trie v0.8.4
2026-07-29T09:50:44.1105691Z    Compiling futures-executor v0.3.32
2026-07-29T09:50:44.1366325Z    Compiling pkcs8 v0.11.0-rc.10
2026-07-29T09:50:44.2218797Z    Compiling url v2.5.8
2026-07-29T09:50:44.3541685Z    Compiling rusqlite v0.32.1
2026-07-29T09:50:44.4065979Z    Compiling toml v0.8.23
2026-07-29T09:50:44.5599313Z    Compiling spin v0.9.8
2026-07-29T09:50:44.5754603Z    Compiling vergen-gitcl v1.0.8
2026-07-29T09:50:44.7760287Z    Compiling hmac v0.12.1
2026-07-29T09:50:44.8476901Z    Compiling windows-threading v0.2.1
2026-07-29T09:50:44.9459205Z    Compiling ryu v1.0.23
2026-07-29T09:50:44.9459752Z    Compiling tower-layer v0.3.3
2026-07-29T09:50:45.0375441Z    Compiling arrayvec v0.7.6
2026-07-29T09:50:45.1589211Z    Compiling signature v3.0.0
2026-07-29T09:50:45.2935381Z    Compiling spt-store v0.45.0 (C:\actions-runner\_work\spt-bs-core\spt-bs-core\crates\spt-store)
2026-07-29T09:50:45.2937020Z    Compiling ed25519 v3.0.0-rc.4
2026-07-29T09:50:45.3107445Z    Compiling windows-future v0.3.2
2026-07-29T09:50:45.3430456Z    Compiling hickory-proto v0.26.0-beta.4
2026-07-29T09:50:45.5029460Z    Compiling proc-macro-crate v3.5.0
2026-07-29T09:50:45.6032694Z    Compiling futures v0.3.32
2026-07-29T09:50:45.7570861Z    Compiling ghash v0.5.1
2026-07-29T09:50:46.0464174Z    Compiling data-encoding-macro-internal v0.1.18
2026-07-29T09:50:46.0564728Z    Compiling aes v0.8.4
2026-07-29T09:50:46.1503272Z    Compiling ctr v0.9.2
2026-07-29T09:50:46.2062362Z    Compiling windows-collections v0.3.2
2026-07-29T09:50:46.2358276Z    Compiling windows-numerics v0.3.1
2026-07-29T09:50:46.2358766Z    Compiling cobs v0.3.0
2026-07-29T09:50:46.4154457Z    Compiling postcard-derive v0.2.2
2026-07-29T09:50:46.4462426Z    Compiling sha2 v0.11.0-rc.5
2026-07-29T09:50:46.5663925Z    Compiling time v0.3.47
2026-07-29T09:50:46.5761573Z    Compiling http-body-util v0.1.3
2026-07-29T09:50:46.7828123Z    Compiling aead v0.5.2
2026-07-29T09:50:46.8048018Z    Compiling ipconfig v0.3.4
2026-07-29T09:50:46.8598643Z    Compiling widestring v1.2.1
2026-07-29T09:50:46.9629026Z    Compiling utf8parse v0.2.2
2026-07-29T09:50:46.9629503Z    Compiling aes-gcm v0.10.3
2026-07-29T09:50:46.9900800Z    Compiling windows v0.62.2
2026-07-29T09:50:47.1013177Z    Compiling data-encoding-macro v0.1.20
2026-07-29T09:50:47.1655779Z    Compiling num_enum_derive v0.7.6
2026-07-29T09:50:47.2171025Z    Compiling postcard v1.1.3
2026-07-29T09:50:47.4004122Z    Compiling ed25519-dalek v3.0.0-pre.6
2026-07-29T09:50:47.4439536Z    Compiling tower v0.5.3
2026-07-29T09:50:47.5373663Z    Compiling crossbeam-epoch v0.9.18
2026-07-29T09:50:47.7391628Z    Compiling crossbeam-channel v0.5.15
2026-07-29T09:50:47.7840106Z    Compiling tempfile v3.27.0
2026-07-29T09:50:47.8842253Z    Compiling chrono v0.4.45
2026-07-29T09:50:47.9532826Z    Compiling async-trait v0.1.89
2026-07-29T09:50:48.0500979Z    Compiling hyper v1.10.1
2026-07-29T09:50:48.1038242Z    Compiling spt-msg v0.45.0 (C:\actions-runner\_work\spt-bs-core\spt-bs-core\crates\spt-msg)
2026-07-29T09:50:48.2234908Z    Compiling enum-assoc v1.3.0
2026-07-29T09:50:48.5458555Z    Compiling iroh-metrics-derive v0.4.1
2026-07-29T09:50:48.6355252Z    Compiling strum_macros v0.28.0
2026-07-29T09:50:48.7555106Z    Compiling windows-registry v0.6.1
2026-07-29T09:50:48.8220350Z    Compiling blake3 v1.8.5
2026-07-29T09:50:49.1029843Z    Compiling memoffset v0.6.5
2026-07-29T09:50:49.8659831Z    Compiling noq v0.18.0
2026-07-29T09:50:50.0519958Z    Compiling netwatch v0.16.0
2026-07-29T09:50:50.1774155Z    Compiling acto v0.8.2
2026-07-29T09:50:50.5836471Z    Compiling hyper-util v0.1.20
2026-07-29T09:50:50.8558744Z    Compiling spt-runtime v0.45.0 (C:\actions-runner\_work\spt-bs-core\spt-bs-core\crates\spt-runtime)
2026-07-29T09:50:50.9195788Z    Compiling rustc-hash v2.1.2
2026-07-29T09:50:50.9414895Z    Compiling thiserror v1.0.69
2026-07-29T09:50:50.9465639Z    Compiling foldhash v0.2.0
2026-07-29T09:50:50.9580580Z    Compiling identity-hash v0.1.0
2026-07-29T09:50:51.1076879Z    Compiling sorted-index-buffer v0.2.1
2026-07-29T09:50:51.1077399Z    Compiling xml-rs v0.8.28
2026-07-29T09:50:51.1186198Z    Compiling mac-addr v0.3.0
2026-07-29T09:50:51.1516162Z    Compiling lru-slab v0.1.2
2026-07-29T09:50:51.3636167Z    Compiling tagptr v0.2.0
2026-07-29T09:50:51.3636680Z    Compiling iroh-relay v0.98.0
2026-07-29T09:50:51.3990224Z    Compiling netdev v0.42.0
2026-07-29T09:50:51.4534680Z    Compiling hashbrown v0.16.1
2026-07-29T09:50:51.6905970Z    Compiling moka v0.12.15
2026-07-29T09:50:51.7316138Z    Compiling iroh-metrics v0.38.3
2026-07-29T09:50:52.0171905Z    Compiling xmltree v0.10.3
2026-07-29T09:50:52.2881405Z    Compiling num_enum v0.7.6
2026-07-29T09:50:52.3643636Z    Compiling tower-http v0.6.11
2026-07-29T09:50:52.3893658Z    Compiling iroh-base v0.98.0
2026-07-29T09:50:52.4221960Z    Compiling attohttpc v0.30.1
2026-07-29T09:50:52.6844711Z    Compiling n0-watcher v0.6.1
2026-07-29T09:50:52.8294191Z    Compiling tokio-stream v0.1.18
2026-07-29T09:50:52.8861303Z    Compiling thiserror-impl v1.0.69
2026-07-29T09:50:53.0532106Z    Compiling serial-core v0.4.0
2026-07-29T09:50:53.3114454Z    Compiling simple-dns v0.9.3
2026-07-29T09:50:53.3114927Z    Compiling resolv-conf v0.7.6
2026-07-29T09:50:53.3501776Z    Compiling sha1_smol v1.0.1
2026-07-29T09:50:53.5232068Z    Compiling winreg v0.10.1
2026-07-29T09:50:53.6272634Z    Compiling simdutf8 v0.1.5
2026-07-29T09:50:53.6825851Z    Compiling constant_time_eq v0.4.2
2026-07-29T09:50:53.6880623Z    Compiling arrayref v0.3.9
2026-07-29T09:50:53.8630164Z    Compiling smol_str v0.1.24
2026-07-29T09:50:53.8991547Z    Compiling strum v0.28.0
2026-07-29T09:50:53.8991968Z    Compiling serial-windows v0.4.0
2026-07-29T09:50:53.9038303Z    Compiling igd-next v0.17.1
2026-07-29T09:50:54.1712467Z    Compiling lru v0.16.4
2026-07-29T09:50:54.2080279Z    Compiling webpki-roots v1.0.7
2026-07-29T09:50:54.2456855Z    Compiling seize v0.5.1
2026-07-29T09:50:54.2731280Z    Compiling serde_bytes v0.11.19
2026-07-29T09:50:54.3851450Z    Compiling iroh v0.98.2
2026-07-29T09:50:54.4480836Z    Compiling cmov v0.5.4
2026-07-29T09:50:54.5467503Z    Compiling iroh-dns v0.98.0
2026-07-29T09:50:54.6408342Z    Compiling pin-utils v0.1.0
2026-07-29T09:50:54.7298732Z    Compiling bitflags v1.3.2
2026-07-29T09:50:54.7343800Z    Compiling lazy_static v1.5.0
2026-07-29T09:50:54.7838831Z    Compiling ctutils v0.4.2
2026-07-29T09:50:54.7839545Z    Compiling nix v0.25.1
2026-07-29T09:50:54.8126391Z    Compiling swarm-discovery v0.6.0-alpha.2
2026-07-29T09:50:54.8395594Z    Compiling shared_library v0.1.9
2026-07-29T09:50:54.8940958Z    Compiling filedescriptor v0.8.3
2026-07-29T09:50:54.8941489Z    Compiling papaya v0.2.4
2026-07-29T09:50:54.9100188Z    Compiling serial v0.4.0
2026-07-29T09:50:55.1168066Z    Compiling hkdf v0.12.4
2026-07-29T09:50:55.1634472Z    Compiling backon v1.6.0
2026-07-29T09:50:55.1703204Z    Compiling vte_generate_state_changes v0.1.2
2026-07-29T09:50:55.1980057Z    Compiling shell-words v1.1.1
2026-07-29T09:50:55.2110804Z    Compiling downcast-rs v1.2.1
2026-07-29T09:50:55.2954938Z    Compiling unicode-width v0.2.0
2026-07-29T09:50:55.3303476Z    Compiling spake2 v0.4.0
2026-07-29T09:50:55.3304026Z    Compiling sha1 v0.10.6
2026-07-29T09:50:55.4279830Z    Compiling portable-pty v0.8.1
2026-07-29T09:50:55.4746583Z    Compiling unicode-width v0.1.14
2026-07-29T09:50:55.5376045Z    Compiling doctest-file v1.1.1
2026-07-29T09:50:55.5607917Z    Compiling recvmsg v1.0.0
2026-07-29T09:50:55.6518844Z    Compiling spt-live v0.45.0 (C:\actions-runner\_work\spt-bs-core\spt-bs-core\crates\spt-live)
2026-07-29T09:50:55.7016155Z    Compiling vte v0.13.1
2026-07-29T09:50:55.7016663Z    Compiling darling_core v0.23.0
2026-07-29T09:50:55.7152501Z    Compiling once_cell_polyfill v1.70.2
2026-07-29T09:50:55.7980337Z    Compiling anstyle v1.0.14
2026-07-29T09:50:55.8802295Z    Compiling anstyle-parse v1.0.0
2026-07-29T09:50:55.8803542Z    Compiling anstyle-query v1.1.5
2026-07-29T09:50:56.0415190Z    Compiling instability v0.3.12
2026-07-29T09:50:56.1953287Z    Compiling anstyle-wincon v3.0.11
2026-07-29T09:50:56.1953729Z    Compiling foldhash v0.1.5
2026-07-29T09:50:56.2116616Z    Compiling paste v1.0.15
2026-07-29T09:50:56.2119929Z    Compiling interprocess v2.4.2
2026-07-29T09:50:56.4474368Z    Compiling colorchoice v1.0.5
2026-07-29T09:50:56.5707202Z    Compiling is_terminal_polyfill v1.70.2
2026-07-29T09:50:56.6500065Z    Compiling hashbrown v0.15.5
2026-07-29T09:50:56.7264417Z    Compiling spt-term v0.45.0 (C:\actions-runner\_work\spt-bs-core\spt-bs-core\crates\spt-term)
2026-07-29T09:50:56.7458550Z    Compiling anstream v1.0.0
2026-07-29T09:50:56.7861285Z    Compiling strum_macros v0.26.4
2026-07-29T09:50:56.8241202Z    Compiling terminal_size v0.4.4
2026-07-29T09:50:57.0198613Z    Compiling itertools v0.13.0
2026-07-29T09:50:57.0635421Z    Compiling crossterm_winapi v0.9.1
2026-07-29T09:50:57.1068739Z    Compiling castaway v0.2.4
2026-07-29T09:50:57.3349653Z    Compiling static_assertions v1.1.0
2026-07-29T09:50:57.3431297Z    Compiling bytemuck v1.25.2
2026-07-29T09:50:57.4222449Z    Compiling clap_lex v1.1.0
2026-07-29T09:50:57.4637342Z    Compiling indoc v2.0.7
2026-07-29T09:50:57.4909045Z    Compiling compact_str v0.8.2
2026-07-29T09:50:57.8056605Z    Compiling wmi v0.18.4
2026-07-29T09:50:57.8659244Z    Compiling rgb v0.8.53
2026-07-29T09:50:57.8659725Z    Compiling clap_builder v4.6.0
2026-07-29T09:50:58.1658696Z    Compiling crossterm v0.28.1
2026-07-29T09:50:58.2004934Z    Compiling lru v0.12.5
2026-07-29T09:50:58.3818264Z    Compiling clap_derive v4.6.1
2026-07-29T09:50:58.7475329Z    Compiling unicode-truncate v1.1.0
2026-07-29T09:50:58.9174966Z    Compiling cassowary v0.3.0
2026-07-29T09:50:59.0676197Z    Compiling strum v0.26.3
2026-07-29T09:50:59.0890354Z    Compiling error-code v3.3.2
2026-07-29T09:50:59.2315977Z    Compiling clipboard-win v5.4.1
2026-07-29T09:50:59.2564917Z    Compiling avt v0.18.0
2026-07-29T09:50:59.4376729Z    Compiling portmapper v0.16.0
2026-07-29T09:50:59.7407640Z    Compiling darling_macro v0.23.0
2026-07-29T09:50:59.8121586Z    Compiling spt-test-support v0.45.0 (C:\actions-runner\_work\spt-bs-core\spt-bs-core\crates\spt-test-support)
2026-07-29T09:50:59.9084309Z    Compiling nucleo-matcher v0.3.1
2026-07-29T09:50:59.9810064Z    Compiling qrcode v0.14.1
2026-07-29T09:51:00.3408696Z    Compiling darling v0.23.0
2026-07-29T09:51:01.0196920Z    Compiling clap v4.6.1
2026-07-29T09:51:01.7670727Z    Compiling ratatui v0.29.0
2026-07-29T09:51:05.1115708Z    Compiling mock-adapter v0.45.0 (C:\actions-runner\_work\spt-bs-core\spt-bs-core\adapters\mock)
2026-07-29T09:51:20.5713685Z    Compiling rustls-webpki v0.103.13
2026-07-29T09:51:24.0172323Z    Compiling tokio-rustls v0.26.4
2026-07-29T09:51:24.0172827Z    Compiling rustls-platform-verifier v0.7.0
2026-07-29T09:51:24.0173178Z    Compiling noq-proto v0.17.0
2026-07-29T09:51:24.4153098Z    Compiling hickory-net v0.26.0-beta.4
2026-07-29T09:51:24.4222623Z    Compiling hyper-rustls v0.27.9
2026-07-29T09:51:24.4236218Z    Compiling tokio-websockets v0.13.2
2026-07-29T09:51:28.1620204Z    Compiling hickory-resolver v0.26.0-beta.4
2026-07-29T09:51:29.8301541Z    Compiling reqwest v0.13.4
2026-07-29T09:52:13.5813982Z    Compiling spt-net v0.45.0 (C:\actions-runner\_work\spt-bs-core\spt-bs-core\crates\spt-net)
2026-07-29T09:52:16.3635788Z    Compiling spt-daemon v0.45.0 (C:\actions-runner\_work\spt-bs-core\spt-bs-core\crates\spt-daemon)
2026-07-29T09:52:34.1908024Z    Compiling spt v0.45.0 (C:\actions-runner\_work\spt-bs-core\spt-bs-core\crates\spt)
2026-07-29T09:52:34.1908875Z    Compiling xtask v0.45.0 (C:\actions-runner\_work\spt-bs-core\spt-bs-core\crates\xtask)
2026-07-29T09:52:47.3603939Z     Finished `test` profile [unoptimized + debuginfo] target(s) in 2m 25s
2026-07-29T09:52:47.3994651Z      Running unittests src\capture_player.rs (target\debug\deps\capture_player-4041a5d23c493935.exe)
2026-07-29T09:52:47.4900996Z 
2026-07-29T09:52:47.4902779Z running 2 tests
2026-07-29T09:52:47.4906133Z test tests::refuses_a_length_mismatch ... ok
2026-07-29T09:52:47.4906473Z test tests::parses_a_well_formed_record ... ok
2026-07-29T09:52:47.4906662Z 
2026-07-29T09:52:47.4906953Z test result: ok. 2 passed; 0 failed; 0 ignored; 0 measured; 0 filtered out; finished in 0.00s
2026-07-29T09:52:47.4907350Z 
2026-07-29T09:52:47.4915707Z      Running unittests src\console_mode_probe.rs (target\debug\deps\console_mode_probe-5546b6a912c0f138.exe)
2026-07-29T09:52:47.5726622Z 
2026-07-29T09:52:47.5727061Z running 0 tests
2026-07-29T09:52:47.5727229Z 
2026-07-29T09:52:47.5727531Z test result: ok. 0 passed; 0 failed; 0 ignored; 0 measured; 0 filtered out; finished in 0.00s
2026-07-29T09:52:47.5727814Z 
2026-07-29T09:52:47.5740536Z      Running unittests src\main.rs (target\debug\deps\mock_session-8f31747bb8b55190.exe)
2026-07-29T09:52:47.6767793Z 
2026-07-29T09:52:47.6769292Z running 0 tests
2026-07-29T09:52:47.6769553Z 
2026-07-29T09:52:47.6769880Z test result: ok. 0 passed; 0 failed; 0 ignored; 0 measured; 0 filtered out; finished in 0.00s
2026-07-29T09:52:47.6770323Z 
2026-07-29T09:52:47.6782252Z      Running unittests src\shell.rs (target\debug\deps\mock_shell-02933291fe718159.exe)
2026-07-29T09:52:47.7783632Z 
2026-07-29T09:52:47.7784146Z running 0 tests
2026-07-29T09:52:47.7784338Z 
2026-07-29T09:52:47.7784670Z test result: ok. 0 passed; 0 failed; 0 ignored; 0 measured; 0 filtered out; finished in 0.00s
2026-07-29T09:52:47.7785032Z 
2026-07-29T09:52:47.7831259Z      Running unittests tests\fixtures\gh_fixture.rs (target\debug\deps\gh_fixture-3c229eadbec9b8c9.exe)
2026-07-29T09:52:47.8577878Z 
2026-07-29T09:52:47.8578311Z running 0 tests
2026-07-29T09:52:47.8578450Z 
2026-07-29T09:52:47.8578929Z test result: ok. 0 passed; 0 failed; 0 ignored; 0 measured; 0 filtered out; finished in 0.00s
2026-07-29T09:52:47.8579217Z 
2026-07-29T09:52:47.8589577Z      Running unittests tests\fixtures\git_fixture.rs (target\debug\deps\git_fixture-1ea8518c85582f21.exe)
2026-07-29T09:52:47.9441048Z 
2026-07-29T09:52:47.9441497Z running 0 tests
2026-07-29T09:52:47.9441712Z 
2026-07-29T09:52:47.9442038Z test result: ok. 0 passed; 0 failed; 0 ignored; 0 measured; 0 filtered out; finished in 0.00s
2026-07-29T09:52:47.9442472Z 
2026-07-29T09:52:47.9452842Z      Running unittests tests\fixtures\post_step_fixture.rs (target\debug\deps\post_step_fixture-1d18b8dbc96bea00.exe)
2026-07-29T09:52:48.0358891Z 
2026-07-29T09:52:48.0359391Z running 0 tests
2026-07-29T09:52:48.0359610Z 
2026-07-29T09:52:48.0359946Z test result: ok. 0 passed; 0 failed; 0 ignored; 0 measured; 0 filtered out; finished in 0.00s
2026-07-29T09:52:48.0360367Z 
2026-07-29T09:52:48.0370780Z      Running unittests src\main.rs (target\debug\deps\spt-00956f2f38eb4ff4.exe)
2026-07-29T09:52:48.9532599Z 
2026-07-29T09:52:48.9533072Z running 457 tests
2026-07-29T09:52:48.9543490Z test api::auth::tests::mints_distinct_nonempty_tokens ... ok
2026-07-29T09:52:49.0113426Z test api::auth::tests::dead_owner_repin_refused_when_sid_is_a_psyche_custody_sid ... ok
2026-07-29T09:52:49.0319359Z test api::auth::tests::dead_owner_repin_refused_when_sid_owns_another_perch ... ok
2026-07-29T09:52:49.0698265Z test api::auth::tests::dead_owner_repin_still_rescues_a_non_custody_sid ... ok
2026-07-29T09:52:49.0818528Z test api::auth::tests::session_id_proof_authenticates ... ok
2026-07-29T09:52:49.0973618Z test api::auth::tests::missing_endpoint_is_no_endpoint ... ok
2026-07-29T09:52:49.0977486Z test api::auth::tests::token_proof_authenticates ... ok
2026-07-29T09:52:49.0986496Z test api::delivery::tests::inject_resolution_drops_pty_defaults_hook ... ok
2026-07-29T09:52:49.0987012Z test api::delivery::tests::inject_all_pty_falls_back_to_hook ... ok
2026-07-29T09:52:49.1137937Z test api::auth::tests::no_proof_is_refused ... ok
2026-07-29T09:52:49.7601174Z test api::auth::tests::pinned_to_dead_sid_mismatched_poll_repins ... ok
2026-07-29T09:52:49.7910431Z test api::auth::tests::live_owner_mismatch_still_refuses ... ok
2026-07-29T09:52:49.8054915Z test api::auth::tests::worker_missing_is_no_endpoint ... ok
2026-07-29T09:52:49.8057137Z test api::auth::tests::token_auth_path_unchanged ... ok
2026-07-29T09:52:49.8272765Z test api::auth::tests::worker_parent_current_sid_authenticates_after_rotation ... ok
2026-07-29T09:52:49.8479999Z test api::auth::tests::worker_stored_sid_authenticates ... ok
2026-07-29T09:52:49.8644245Z test api::auth::tests::worker_wrong_sid_and_token_only_refused ... ok
2026-07-29T09:52:49.8789381Z test api::auth::tests::wrong_token_and_wrong_session_refused ... ok
2026-07-29T09:52:49.9130197Z test api::delivery::tests::an_undated_state_is_dated_by_a_non_edge_report ... ok
2026-07-29T09:52:49.9175236Z test api::delivery::tests::echo_gate_explicit_toggle ... ok
2026-07-29T09:52:49.9329224Z test api::delivery::tests::idle_busy_transitions_manage_sentinels ... ok
2026-07-29T09:52:49.9332545Z test api::reporting::tests::capability_lists_hostable_types ... ok
2026-07-29T09:52:50.0515345Z test api::delivery::tests::idle_drain_peek_returns_non_deferred_rows_only ... ok
2026-07-29T09:52:50.0606293Z test api::delivery::tests::idle_no_gate_does_not_arm_gate ... ok
2026-07-29T09:52:50.1411703Z test api::delivery::tests::only_a_real_state_edge_stamps_the_transition_instant ... ok
2026-07-29T09:52:50.1413157Z test api::reporting::tests::endpoint_info_attached_node_from_honest_stamps ... ok
2026-07-29T09:52:50.1414328Z test api::reporting::tests::endpoint_info_attached_node_self_attributes_own_node_driver ... ok
2026-07-29T09:52:50.1416519Z test api::reporting::tests::endpoint_info_json_always_carries_an_activity_word ... ok
2026-07-29T09:52:50.3658903Z test api::delivery::tests::poll_drain_holds_deferred_while_resting_and_releases_once_on_wake ... ok
2026-07-29T09:52:50.3663293Z test api::reporting::tests::env_aliases_resolved_from_manifest ... ok
2026-07-29T09:52:50.5379169Z test api::delivery::tests::poll_drain_suppresses_idle_only_which_reaches_the_relay ... ok
2026-07-29T09:52:50.5382033Z test api::reporting::tests::filedrops_are_fixed_named_files ... ok
2026-07-29T09:52:50.7310735Z test api::delivery::tests::poll_drain_validates_notify_copies_against_their_rows ... ok
2026-07-29T09:52:50.8528988Z test api::delivery::tests::poll_drains_non_deferred_by_default ... ok
2026-07-29T09:52:50.9630853Z test api::delivery::tests::poll_only_drains_when_hook_method_present ... ok
2026-07-29T09:52:51.0846944Z test api::reporting::tests::boundary_appends_to_the_session_ledger ... ok
2026-07-29T09:52:51.2875493Z test api::reporting::tests::boundary_missing_perch_refused ... ok
2026-07-29T09:52:51.2933590Z test api::reporting::tests::boundary_injects_deferred_shell_context ... ok
2026-07-29T09:52:51.3723448Z test api::reporting::tests::boundary_rebinds_keeping_anchor ... ok
2026-07-29T09:52:51.3933951Z test api::reporting::tests::boundary_refuses_rotating_onto_a_psyche_custody_sid ... ok
2026-07-29T09:52:51.5936704Z test api::reporting::tests::boundary_resurfaces_undismissed_notifs ... ok
2026-07-29T09:52:51.6023204Z test api::startup::tests::a_dead_binder_pid_proves_nothing_and_never_drops_the_stamp ... ok
2026-07-29T09:52:51.6024224Z test api::startup::tests::a_dead_relays_capability_stamp_is_not_resurrected_by_a_listener_rebind ... ok
2026-07-29T09:52:51.7468291Z test api::reporting::tests::boundary_with_a_fresh_sid_is_unaffected_by_the_squat_guard ... ok
2026-07-29T09:52:51.7616813Z test api::reporting::tests::digest_entry_validates_and_appends_to_digest_log ... ok
2026-07-29T09:52:51.7834960Z test api::reporting::tests::driven_by_reads_daemon_marker ... ok
2026-07-29T09:52:51.8108113Z test api::reporting::tests::endpoint_info_activity_word_tracks_the_idle_sentinel ... ok
2026-07-29T09:52:51.8299125Z test api::reporting::tests::endpoint_info_reports_and_refuses ... ok
2026-07-29T09:52:51.8867981Z test api::reporting::tests::erase_unregisters_regardless_of_liveness ... ok
2026-07-29T09:52:51.9005637Z test api::reporting::tests::hint_once_per_session_one_per_message ... ok
2026-07-29T09:52:51.9198280Z test api::reporting::tests::history_log_appends ... ok
2026-07-29T09:52:51.9248034Z test api::reporting::tests::presence_records_endpoint ... ok
2026-07-29T09:52:52.0452672Z test api::reporting::tests::session_end_erase_reaps_stale_worker_then_proceeds ... ok
2026-07-29T09:52:52.1255937Z test api::reporting::tests::session_end_erase_refused_with_live_children ... ok
2026-07-29T09:52:52.1596964Z test api::reporting::tests::session_end_erase_wipes_childless_perch ... ok
2026-07-29T09:52:52.1598539Z test api::startup::tests::fresh_bind_over_dead_life_needs_both_terminal_and_a_new_session ... ok
2026-07-29T09:52:52.1995408Z test api::reporting::tests::session_end_soft_preserves_state ... ok
2026-07-29T09:52:52.2462282Z test api::reporting::tests::soft_end_preserves_a_live_listeners_address ... ok
2026-07-29T09:52:52.2463254Z test api::startup::tests::listen_never_asserts_hosting_topology_and_bind_still_does ... ok
2026-07-29T09:52:52.2464590Z test api::startup::tests::listen_online_gate_refuses_capability_only_online ... ok
2026-07-29T09:52:52.2465921Z test api::startup::tests::listen_orphan_exit_line_names_self_and_parent ... ok
2026-07-29T09:52:52.3092357Z test api::reporting::tests::soft_end_still_cleans_a_dead_listeners_address ... ok
2026-07-29T09:52:52.5492971Z test api::startup::tests::a_listener_over_a_dead_pty_is_not_offlined_by_the_liveness_reconcile ... ok
2026-07-29T09:52:52.6410413Z test api::startup::tests::bind_assigns_home_and_revive_preserves_it ... ok
2026-07-29T09:52:52.6633826Z test api::startup::tests::parent_watchdog_triggers_exit_on_a_dead_parent_only ... ok
2026-07-29T09:52:52.7046046Z test api::startup::tests::bind_gateway_earns_no_online_stamp ... ok
2026-07-29T09:52:53.1729119Z test api::startup::tests::bind_listen_control_detach_keeps_the_earned_hosting_authority ... ok
2026-07-29T09:52:53.1730603Z test api::startup::tests::read_env_measured_capture_replaces_prior_stamp ... ok
2026-07-29T09:52:53.2574963Z test api::startup::tests::bind_live_agent_over_prior_ready_agent_earns_online_on_controllable_with_preserved_type ... ok
2026-07-29T09:52:53.3608028Z test api::startup::tests::bind_records_cwd_so_picker_can_group_by_project ... ok
2026-07-29T09:52:53.3653564Z test api::startup::tests::bind_refuses_a_session_id_that_squats_a_psyche_custody_sid ... ok
2026-07-29T09:52:53.4557721Z test api::startup::tests::bind_with_type_establishes_a_gateway_endpoint ... ok
2026-07-29T09:52:53.4559075Z test api::startup::tests::seed_fail_eof_gives_actionable_stale_broker_hint ... ok
2026-07-29T09:52:53.4560385Z test api::startup::tests::seed_restorable_spends_dead_seeds_restores_recoverable ... ok
2026-07-29T09:52:53.4740853Z test api::startup::tests::bind_with_unrelated_sid_is_unaffected_by_the_squat_guard ... ok
2026-07-29T09:52:53.4786727Z test api::startup::tests::empty_session_seed_refusal_spends_the_seed_no_restore ... ok
2026-07-29T09:52:53.4850436Z test api::startup::tests::empty_session_seed_refused ... ok
2026-07-29T09:52:53.6055027Z test api::startup::tests::establish_stamps_controllable_by_hosting_mode ... ok
2026-07-29T09:52:53.7165858Z test api::startup::tests::fresh_create_over_a_stopped_life_reads_active_with_no_wake ... ok
2026-07-29T09:52:53.7939381Z test api::startup::tests::fresh_create_with_no_prior_carries_no_rest_state ... ok
2026-07-29T09:52:53.7940086Z test api::startup::tests::the_pid_role_is_stamped_from_the_entry_path ... ok
2026-07-29T09:52:53.8146105Z test api::startup::tests::live_perch_under_other_session_conflicts ... ok
2026-07-29T09:52:53.8162187Z test api::tests::adapter_is_optional ... ok
2026-07-29T09:52:53.8189722Z test api::startup::tests::missing_seed_refused ... ok
2026-07-29T09:52:53.8410515Z test api::startup::tests::no_seed_is_the_fallback_trigger_then_sid_binds ... ok
2026-07-29T09:52:53.9109706Z test api::startup::tests::post_spawn_bind_establishes_perch ... ok
2026-07-29T09:52:53.9354684Z test api::startup::tests::prebind_refusal_restores_the_seed_for_retry ... ok
2026-07-29T09:52:53.9364730Z test api::tests::state_value_is_validated ... ok
2026-07-29T09:52:53.9435543Z test api::tests::surface_parses ... ok
2026-07-29T09:52:54.0264683Z test api::startup::tests::rebind_same_session_ok ... ok
2026-07-29T09:52:54.1300847Z test api::startup::tests::revive_preserves_prior_rest_state_and_dormant_anchor ... ok
2026-07-29T09:52:54.2194106Z test api::startup::tests::revive_without_cwd_preserves_prior_cwd ... ok
2026-07-29T09:52:54.2456970Z test api::startup::tests::seed_bind_records_seed_captured_cwd ... ok
2026-07-29T09:52:54.2574863Z test api::startup::tests::session_id_fallback_binds_live_perch_from_sid ... ok
2026-07-29T09:52:54.2713981Z test api::startup::tests::session_id_fallback_refuses_empty_sid_and_dead_anchor ... ok
2026-07-29T09:52:54.2718869Z test api::startup::tests::session_id_fallback_refuses_a_psyche_custody_sid ... ok
2026-07-29T09:52:54.2731022Z test cli::resume_resolution_tests::resume_never_feeds_a_provisional ... ok
2026-07-29T09:52:54.2732547Z test cli::run_home_tests::order_by_mru_orders_guidance ... ok
2026-07-29T09:52:54.2734265Z test cli::run_home_tests::run_home_resolution_matrix ... ok
2026-07-29T09:52:54.2735788Z test cli::run_on_live_tests::run_on_live_never_duplicates_and_create_conflicts ... ok
2026-07-29T09:52:54.2737456Z test cli::run_target_tests::resolve_run_target_quadrants ... ok
2026-07-29T09:52:54.2780181Z test api::startup::tests::stale_seed_refusal_spends_the_seed_no_restore ... ok
2026-07-29T09:52:54.2782184Z test cli::tests::a_status_row_reads_held_over_running_and_carries_its_evidence ... ok
2026-07-29T09:52:54.2833187Z test cli::tests::access_subcommands_parse ... ok
2026-07-29T09:52:54.2853329Z test api::startup::tests::stale_seed_with_dead_anchor_refused ... ok
2026-07-29T09:52:54.2879053Z test cli::tests::adapter_add_transport_flags_parse ... ok
2026-07-29T09:52:54.3123173Z test api::startup::tests::successful_bind_consumes_the_seed_exactly_once ... ok
2026-07-29T09:52:54.3229482Z test cli::tests::a_local_hit_never_asks_the_broker ... ok
2026-07-29T09:52:54.3337987Z test api::startup::tests::valid_seed_binds_live_perch ... ok
2026-07-29T09:52:54.3340006Z test cli::tests::adapter_name_validation_flags_every_unknown ... ok
2026-07-29T09:52:54.3342125Z test cli::tests::adapter_names_comma_list_parses_and_refuses_empties ... ok
2026-07-29T09:52:54.3346314Z test api::tests::ctx_manifest_override_wins_when_manifest_present ... ok
2026-07-29T09:52:54.3453655Z test api::tests::ctx_manifest_unregistered_no_manifest_is_none_not_fatal ... ok
2026-07-29T09:52:54.3459927Z test api::tests::ctx_manifest_resolves_from_registry_when_manifest_absent ... ok
2026-07-29T09:52:54.3464288Z test cli::tests::adapter_translate_proof_gates_on_commit ... FAILED
2026-07-29T09:52:54.3501504Z test api::tests::load_manifest_resolves_composite_adapter_option ... ok
2026-07-29T09:52:54.3506570Z test cli::tests::adapter_update_install_dir_is_registered_source_dir_not_repo_name ... ok
2026-07-29T09:52:54.3511600Z test cli::tests::adapter_update_notice_absent_when_no_message ... ok
2026-07-29T09:52:54.3516749Z test cli::tests::adapter_update_notice_renders_declared_message_markdown ... ok
2026-07-29T09:52:54.3518872Z test cli::tests::adapter_update_summary_and_exit_aggregate_isolated_failures ... ok
2026-07-29T09:52:54.3519309Z test cli::tests::adapter_translate_proof_parses ... ok
2026-07-29T09:52:54.3536936Z test cli::tests::adapter_version_parses ... ok
2026-07-29T09:52:54.3595304Z test cli::tests::adapter_subcommands_parse ... ok
2026-07-29T09:52:54.3597926Z test cli::tests::all_hidden_this_node_suppresses_no_perches_marker ... ok
2026-07-29T09:52:54.3599989Z test cli::tests::already_applied_message_reads_up_to_date_no_restart ... ok
2026-07-29T09:52:54.3602471Z test cli::tests::any_single_evidence_source_is_enough_and_only_nothing_refuses ... ok
2026-07-29T09:52:54.3627177Z test cli::tests::api_adapter_flag_is_group_level_not_post_subcommand ... ok
2026-07-29T09:52:54.3652475Z test cli::tests::api_listen_accepts_session_id_flag ... ok
2026-07-29T09:52:54.3654563Z test cli::tests::applied_message_appends_restart_required_notice ... ok
2026-07-29T09:52:54.3656591Z test cli::tests::applied_message_renders_semver_or_counter_fallback_and_states_applied ... ok
2026-07-29T09:52:54.3884073Z test api::worker::tests::cascade_guard_tracks_live_children ... ok
2026-07-29T09:52:54.4849227Z test api::worker::tests::guard_clears_only_when_all_children_stopped ... ok
2026-07-29T09:52:54.4880468Z test cli::tests::bare_spt_parses_to_none ... ok
2026-07-29T09:52:54.4883153Z test cli::tests::bare_tty_guard ... ok
2026-07-29T09:52:54.4925601Z test cli::tests::bare_update_parses_composite_flags ... ok
2026-07-29T09:52:54.4927700Z test cli::tests::broker_image_line_reports_without_warning_or_remedy ... ok
2026-07-29T09:52:54.4929089Z test cli::tests::classify_fetch_reject_matrix ... ok
2026-07-29T09:52:54.4930569Z test cli::tests::classify_flat_archive_never_misfires ... ok
2026-07-29T09:52:54.4931938Z test cli::tests::classify_multiplatform_captures_only_known_triples ... ok
2026-07-29T09:52:54.4933333Z test cli::tests::cli_send_stamps_cli_at_node_origin ... ok
2026-07-29T09:52:54.4934785Z test cli::tests::composite_plans_core_first_and_core_only_skips_adapters ... ok
2026-07-29T09:52:54.4936287Z test cli::tests::connection_lines_net_less_hides_stale_heartbeat ... ok
2026-07-29T09:52:54.4938138Z test cli::tests::coordinator_image_line_is_the_only_stale_warning ... ok
2026-07-29T09:52:54.4941155Z test cli::tests::create_existing_name_is_usage_error ... ok
2026-07-29T09:52:54.4943870Z test cli::tests::create_new_existing_name_is_usage_error ... ok
2026-07-29T09:52:54.5108307Z test cli::tests::create_new_mints_shows_and_requests_save ... ok
2026-07-29T09:52:54.5111002Z test cli::tests::create_not_elevated_refuses_without_saving ... ok
2026-07-29T09:52:54.5176805Z test cli::tests::apply_release_crc_swap_only_swaps_changed ... ok
2026-07-29T09:52:54.5179240Z test cli::tests::cross_node_after_filters_a_sealed_turn_exactly_like_the_local_path ... ok
2026-07-29T09:52:54.5181605Z test cli::tests::daemon_offline_hint_only_when_down ... ok
2026-07-29T09:52:54.5226120Z test cli::tests::daemon_refresh_verb_parses ... ok
2026-07-29T09:52:54.5279500Z test cli::tests::create_prints_joining_material_when_elevated ... ok
2026-07-29T09:52:54.5281979Z test cli::tests::daemonless_apply_message_points_at_finish_or_start ... ok
2026-07-29T09:52:54.5287149Z test cli::tests::deferred_elevation_gate_matrix ... ok
2026-07-29T09:52:54.5304713Z test cli::tests::digest_cursor_flags_parse ... ok
2026-07-29T09:52:54.5323350Z test cli::tests::digest_flag_defaults ... ok
2026-07-29T09:52:54.5325656Z test cli::tests::digest_human_path_keeps_the_stderr_trailer ... ok
2026-07-29T09:52:54.5328677Z test cli::tests::digest_json_carries_version_and_leaves_stderr_clean ... ok
2026-07-29T09:52:54.5330900Z test cli::tests::digest_json_predates_path_still_carries_version ... ok
2026-07-29T09:52:54.5332155Z test cli::tests::empty_store_no_flag_guides_to_pair_or_create ... ok
2026-07-29T09:52:54.5339039Z test cli::tests::daemon_subcommands_parse ... ok
2026-07-29T09:52:54.5370234Z test cli::tests::endpoint_role_parses ... ok
2026-07-29T09:52:54.5372151Z test cli::tests::endpoint_row_json_endpoint_type_is_additive ... ok
2026-07-29T09:52:54.6690859Z test api::worker::tests::worker_poll_drains_spool ... ok
2026-07-29T09:52:54.6818114Z test cli::tests::endpoint_subcommands_parse ... ok
2026-07-29T09:52:54.6819431Z test cli::tests::escalation_choice_parses_fail_closed ... ok
2026-07-29T09:52:54.6919176Z test cli::tests::every_read_status_command_emits_valid_json ... ok
2026-07-29T09:52:54.8472333Z test cli::tests::extract_legacy_flat_stays_flat ... ok
2026-07-29T09:52:54.9403840Z test cli::tests::extract_multiplatform_missing_my_triple_is_typed_rejection ... ok
2026-07-29T09:52:54.9800749Z test api::worker::tests::worker_poll_holds_deferred_while_resting ... ok
2026-07-29T09:52:54.9801567Z test cli::tests::fetch_reject_action_apply_decision ... ok
2026-07-29T09:52:54.9802860Z test cli::tests::filter_after_excludes_at_or_below_cursor ... ok
2026-07-29T09:52:54.9804536Z test cli::tests::filter_after_predates_window_returns_full ... ok
2026-07-29T09:52:54.9805740Z test cli::tests::finish_message_states_fully_live_no_manual_restart ... ok
2026-07-29T09:52:55.0062702Z test cli::tests::extract_multiplatform_places_shared_root_and_flattens_my_triple ... ok
2026-07-29T09:52:55.0064015Z test cli::tests::gh_download_command_no_tag_omits_tag ... ok
2026-07-29T09:52:55.0065637Z test cli::tests::gh_download_command_with_tag_shape ... ok
2026-07-29T09:52:55.0066932Z test cli::tests::gh_failure_classes_render_os_correct_hints ... ok
2026-07-29T09:52:55.0068608Z test cli::tests::gh_release_version_compare_decision ... ok
2026-07-29T09:52:55.0069831Z test cli::tests::gh_version_command_shape ... ok
2026-07-29T09:52:55.0118907Z test cli::tests::grant_subcommands_parse ... ok
2026-07-29T09:52:55.0168051Z test cli::tests::help_groups_cover_every_command ... ok
2026-07-29T09:52:55.0270037Z test cli::tests::hot_path_flat_and_moved_verbs_gone ... ok
2026-07-29T09:52:55.0296852Z test api::worker::tests::worker_start_mints_id_stores_parent_sid_and_metadata ... ok
2026-07-29T09:52:55.0311465Z test cli::tests::how_to_topics_cover_ready_and_send ... ok
2026-07-29T09:52:55.0313022Z test cli::tests::install_platform_check_gates_stamp_and_host_arch ... ok
2026-07-29T09:52:55.0315645Z test cli::tests::instance_rows_palette_and_align ... ok
2026-07-29T09:52:55.0318970Z test cli::tests::instance_rows_project_column ... ok
2026-07-29T09:52:55.0342930Z test cli::tests::invalid_usage_errors ... ok
2026-07-29T09:52:55.0344221Z test cli::tests::join_gate_refuses_without_confirmed_elevation ... ok
2026-07-29T09:52:55.0346228Z test cli::tests::json_activity_key_is_local_only_and_skips_when_unknown ... ok
2026-07-29T09:52:55.0358108Z test cli::tests::json_activity_words_come_from_the_shared_vocabulary_source ... ok
2026-07-29T09:52:55.0386284Z test cli::tests::install_place_is_idempotent_and_path_block_detected ... ok
2026-07-29T09:52:55.0387692Z test cli::tests::json_project_field_skip_if_none ... ok
2026-07-29T09:52:55.0513236Z test cli::tests::multi_subnet_refuses_without_flag_then_resolves_with_it ... ok
2026-07-29T09:52:55.0515375Z test cli::tests::node_group_discards_self_and_skips_empty ... ok
2026-07-29T09:52:55.0517183Z test cli::tests::node_group_freshest_epoch_wins_and_unions_subnets ... ok
2026-07-29T09:52:55.0519126Z test cli::tests::node_group_same_id_two_nodes_two_groups ... ok
2026-07-29T09:52:55.0521260Z test cli::tests::node_grouped_render_structure_and_palette ... ok
2026-07-29T09:52:55.0524427Z test cli::tests::node_level_label_names_an_endpointless_peer ... ok
2026-07-29T09:52:55.0525734Z test api::worker::tests::worker_start_nests_under_parent ... ok
2026-07-29T09:52:55.0527025Z test cli::tests::node_rows_disambiguate_only_on_label_collision ... ok
2026-07-29T09:52:55.0528312Z test cli::tests::node_status_rows_denominator_counts_routable_only ... ok
2026-07-29T09:52:55.0529334Z test cli::tests::node_status_rows_settle_cheap_signals_probe_only_stale ... ok
2026-07-29T09:52:55.0531128Z test cli::tests::not_elevated_refuses_without_leaking_code_or_saving ... ok
2026-07-29T09:52:55.0533525Z test cli::tests::notify_subnet_resolution_home_default ... ok
2026-07-29T09:52:55.0534778Z test cli::tests::origin_asset_urls_latest_and_tag ... ok
2026-07-29T09:52:55.0588214Z test cli::tests::notify_surface_parses ... ok
2026-07-29T09:52:55.0605614Z test cli::tests::pair_namespace_is_gone ... ok
2026-07-29T09:52:55.0608722Z test cli::tests::peer_health_line_names_the_stage_and_stays_silent_when_idle ... ok
2026-07-29T09:52:55.0609979Z test cli::tests::poll_until_ready_fastpath_timeout_and_later_success ... ok
2026-07-29T09:52:55.0611443Z test cli::tests::post_step_notice_arbitration ... ok
2026-07-29T09:52:55.0773642Z test api::worker::tests::worker_start_registration_sid_falls_back_to_presented ... ok
2026-07-29T09:52:55.1962656Z test cli::tests::adapter_digest_proof_fills_session_id_key ... ok
2026-07-29T09:52:55.2785407Z test cli::tests::probe_all_runs_concurrently_in_input_order ... ok
2026-07-29T09:52:55.2786370Z test cli::tests::project_index_line_states_health_not_presence ... ok
2026-07-29T09:52:55.2788006Z test cli::tests::prune_candidates_resolve_never_guess ... ok
2026-07-29T09:52:55.3340251Z test cli::tests::adapter_digest_proof_gates_on_drops ... ok
2026-07-29T09:52:55.3567292Z test cli::tests::probe_all_timeout_settles_false_without_stalling_batch ... ok
2026-07-29T09:52:55.3573503Z test cli::tests::adapter_has_live_endpoint_detects_matching_live_perch ... ok
2026-07-29T09:52:55.3783713Z test cli::tests::registered_github_home_detects_active_collision ... ok
2026-07-29T09:52:55.4103023Z test cli::tests::adapter_has_live_endpoint_false_for_other_or_dead ... ok
2026-07-29T09:52:55.4104382Z test cli::tests::remote_cell_project_ref_from_gossiped_recent_projects ... ok
2026-07-29T09:52:55.4413407Z test cli::tests::adapter_profile_verbs_local_only ... ok
2026-07-29T09:52:55.4414189Z test cli::tests::resolve_transport_auto_follows_probe ... ok
2026-07-29T09:52:55.4463271Z test cli::tests::resolve_transport_explicit_never_probes ... ok
2026-07-29T09:52:55.4464547Z test cli::tests::rest_filter_hides_suspended_shows_all_and_corrupt_always ... ok
2026-07-29T09:52:55.4471337Z test cli::tests::rest_filter_status_first_ordering ... ok
2026-07-29T09:52:55.4474921Z test cli::tests::rest_filter_total_disclosure_and_corrupt_annotation ... ok
2026-07-29T09:52:55.4478181Z test cli::tests::restart_plans_lethal_leg_last ... ok
2026-07-29T09:52:55.4522707Z test cli::tests::ring_timeout_defaults ... ok
2026-07-29T09:52:55.4748691Z test cli::tests::adapter_string_verbs ... ok
2026-07-29T09:52:55.4749958Z test cli::tests::self_pin_annotates_psyche_host_failure ... ok
2026-07-29T09:52:55.4751482Z test cli::tests::self_pin_annotates_translation_fault ... ok
2026-07-29T09:52:55.4753091Z test cli::tests::self_pin_includes_description_when_present ... ok
2026-07-29T09:52:55.4788809Z test cli::tests::send_reply_to_flag_is_removed_and_target_required ... ok
2026-07-29T09:52:55.4818006Z test cli::tests::send_user_msg_flag_parses ... ok
2026-07-29T09:52:55.5008274Z test cli::tests::adapter_use_sets_and_clears_pointer ... ok
2026-07-29T09:52:55.5111156Z test cli::tests::run_bounded_yields_value_or_timeout_default ... ok
2026-07-29T09:52:55.5206343Z test cli::tests::adapter_version_surfaces_declared_adapter_version ... ok
2026-07-29T09:52:55.5461606Z test cli::tests::release_archive_extracts_to_a_registrable_root ... ok
2026-07-29T09:52:55.5520871Z test cli::tests::apply_user_msg_gate_local_origination ... ok
2026-07-29T09:52:55.5704392Z test cli::tests::probe_all_cap_batches_into_windows ... ok
2026-07-29T09:52:56.5800440Z test cli::tests::endpoint_role_overwrite_is_the_sole_writer ... ok
2026-07-29T09:52:56.5892011Z test cli::tests::shell_subcommands_parse ... ok
2026-07-29T09:52:56.6004485Z test cli::tests::show_code_prints_reprovisioning_material ... ok
2026-07-29T09:52:56.6742589Z test cli::tests::endpoint_stop_marks_offline ... ok
2026-07-29T09:53:02.1443872Z test cli::tests::json_payload_rides_as_attr_alongside_body ... ok
2026-07-29T09:53:02.1719191Z test cli::tests::fork_forks_homes_and_deletes_exactly_the_source ... ok
2026-07-29T09:53:02.1821647Z test cli::tests::single_subnet_auto_selects_and_code_matches_seed ... ok
2026-07-29T09:53:18.7969452Z test cli::tests::owner_shutdown_gated_by_can_shutdown_grant ... ok
2026-07-29T09:53:18.8901199Z test cli::tests::stage_then_swap_failed_fetch_preserves_install ... ok
2026-07-29T09:53:19.4083737Z test cli::tests::staged_floor_admits_when_core_meets_floor ... ok
2026-07-29T09:53:19.4631808Z test cli::tests::staged_floor_refuses_above_floor_and_leaves_dest_untouched ... ok
2026-07-29T09:53:19.4632709Z test cli::tests::stall_evict_line_surfaces_only_a_real_tally ... ok
2026-07-29T09:53:19.4634033Z test cli::tests::stop_guard_refuses_live_sessions_without_force ... ok
2026-07-29T09:53:19.4741270Z test cli::tests::subcommands_parse ... ok
2026-07-29T09:53:19.4888503Z test cli::tests::subnet_arg_shapes_parse ... ok
2026-07-29T09:53:19.4892772Z test cli::tests::subnet_status_renders_rows_and_hints_never_secrets ... ok
2026-07-29T09:53:19.4894120Z test cli::tests::subnets_joined_banner_renders_rows_and_divider ... ok
2026-07-29T09:53:19.4895478Z test cli::tests::subprocess_detail_prefers_stderr_then_stdout ... ok
2026-07-29T09:53:19.5208864Z test cli::tests::purge_force_asks_before_it_tears_anything_down ... ok
2026-07-29T09:53:19.5210896Z test cli::tests::this_node_group_merges_roster_with_unbound_truth ... ok
2026-07-29T09:53:19.5212147Z test cli::tests::trust_mutation_gate_refuses_without_confirmed_elevation ... ok
2026-07-29T09:53:19.5214827Z test cli::tests::unknown_elevation_falls_back ... ok
2026-07-29T09:53:19.5217673Z test cli::tests::unknown_named_subnet_is_usage_error ... ok
2026-07-29T09:53:19.5235373Z test cli::tests::update_adapters_verb_parses_with_optional_names ... ok
2026-07-29T09:53:19.5252630Z test cli::tests::update_fetch_apply_flag_parses ... ok
2026-07-29T09:53:19.5269046Z test cli::tests::whoami_parses_as_the_identity_verb ... ok
2026-07-29T09:53:19.5270503Z test elevation::tests::already_elevated_short_circuits_on_every_os ... ok
2026-07-29T09:53:19.5271767Z test elevation::tests::current_returns_a_determinate_level_on_supported_platforms ... ok
2026-07-29T09:53:19.5273027Z test elevation::tests::fallback_message_names_authenticator_app_and_subnet ... ok
2026-07-29T09:53:19.5274066Z test elevation::tests::gate_shows_only_when_confirmed_elevated ... ok
2026-07-29T09:53:19.5275358Z test elevation::tests::launcher_argv_is_absolute_exe_plus_verbatim_args ... ok
2026-07-29T09:53:19.5276746Z test elevation::tests::launchers_never_shell_interpolate_a_crafted_arg ... ok
2026-07-29T09:53:19.5278156Z test elevation::tests::print_hint_floor_uses_absolute_path_each_os ... ok
2026-07-29T09:53:19.5279256Z test elevation::tests::unix_path_order_tty_then_pkexec_then_terminal_then_hint ... ok
2026-07-29T09:53:19.5280316Z test elevation::tests::windows_uac_only_interactive_other_always_prints ... ok
2026-07-29T09:53:19.5281527Z test helpfmt::tests::atx_header_at_line_start_strips_and_bolds ... ok
2026-07-29T09:53:19.5282702Z test helpfmt::tests::bold_styles_with_color_and_strips_without ... ok
2026-07-29T09:53:19.5284205Z test helpfmt::tests::code_styles_with_color_and_strips_without ... ok
2026-07-29T09:53:19.5285238Z test helpfmt::tests::color_enabled_truth_table ... ok
2026-07-29T09:53:19.5286496Z test helpfmt::tests::dual_contract_token_survives_strip_mode ... ok
2026-07-29T09:53:19.5287578Z test helpfmt::tests::dual_contract_token_unstyled_while_prose_styles_on_color ... ok
2026-07-29T09:53:19.5288578Z test helpfmt::tests::empty_and_unmatched_markers_stay_literal ... ok
2026-07-29T09:53:19.5289590Z test helpfmt::tests::link_becomes_its_text ... ok
2026-07-29T09:53:19.5290677Z test helpfmt::tests::marker_never_spans_a_hard_break ... ok
2026-07-29T09:53:19.5291738Z test helpfmt::tests::marker_spans_a_clap_soft_wrap ... ok
2026-07-29T09:53:19.5292717Z test helpfmt::tests::multibyte_text_survives ... ok
2026-07-29T09:53:19.5293771Z test helpfmt::tests::nested_code_inside_bold_styles_both ... ok
2026-07-29T09:53:19.5294781Z test helpfmt::tests::plain_text_is_unchanged ... ok
2026-07-29T09:53:19.5295858Z test helpfmt::tests::preexisting_ansi_is_passed_through_untouched ... ok
2026-07-29T09:53:19.5296678Z test helpfmt::tests::resolve_console_color_strips_when_vt_unavailable ... ok
2026-07-29T09:53:19.5298185Z test picker::data::tests::disambiguate_project_ids_cases ... ok
2026-07-29T09:53:19.5299470Z test picker::data::tests::driven_by_display_renders_name_not_hex ... ok
2026-07-29T09:53:19.5458656Z test cli::tests::purge_offline_gate_and_self_guard ... ok
2026-07-29T09:53:19.5680406Z test cli::tests::the_evidence_census_reads_each_local_source ... ok
2026-07-29T09:53:22.0722825Z test cli::tests::resolve_proof_target_override_reads_on_disk ... ok
2026-07-29T09:53:22.0724902Z test picker::data::tests::indexed_projection_full_w2shaped_and_absent_legs ... ok
2026-07-29T09:53:22.0726061Z test picker::data::tests::non_drivable_predicate_covers_worker_and_psyche ... ok
2026-07-29T09:53:22.0762045Z test cli::tests::purge_removes_every_record ... ok
2026-07-29T09:53:22.8343030Z test cli::tests::shell_channels_relay_sensory_and_text_file ... ok
2026-07-29T09:53:22.8344654Z test picker::data::tests::project_refs_from_sessions_excludes_owlery_and_dedups_newest_first ... ok
2026-07-29T09:53:22.8346268Z test picker::data::tests::project_refs_from_unions_fresh_origin_and_store_branches ... ok
2026-07-29T09:53:22.8347855Z test picker::data::tests::reconcile_overrides_subnet_with_local_roster ... ok
2026-07-29T09:53:22.8698702Z test cli::tests::shell_owner_exclusivity_negatives ... ok
2026-07-29T09:53:22.9634160Z test cli::tests::shell_relink_relaunches_offline_instances_only ... ok
2026-07-29T09:53:22.9635776Z test picker::data::tests::resume_rows_derive_per_row_project_and_drop_owlery_sessions ... ok
2026-07-29T09:53:23.1314395Z test cli::tests::shell_spawn_approval_floor_gates ... ok
2026-07-29T09:53:23.1315261Z test picker::data::tests::row_status_drives_unbound_display ... ok
2026-07-29T09:53:23.4172169Z test cli::tests::shell_spawn_cap_and_over_cap_gates ... ok
2026-07-29T09:53:23.4173385Z test picker::model::tests::adapter_tree_nests_profiles ... ok
2026-07-29T09:53:23.4174692Z test picker::model::tests::back_unwinds ... ok
2026-07-29T09:53:23.4176365Z test picker::model::tests::build_project_choices_head_here_rest ... ok
2026-07-29T09:53:23.4178088Z test picker::model::tests::category_labels_render_display_forms ... ok
2026-07-29T09:53:23.4179317Z test picker::model::tests::category_ring_wraps ... ok
2026-07-29T09:53:23.4180994Z test picker::model::tests::change_adapter_picks_and_returns_to_confirm ... ok
2026-07-29T09:53:23.4183008Z test picker::model::tests::choose_project_outcome_bakes_cwd_and_diverts ... ok
2026-07-29T09:53:23.4184179Z test picker::model::tests::confirm_local_offline_unchanged_by_wake_split ... ok
2026-07-29T09:53:23.4185632Z test picker::model::tests::confirm_options_remote_suspended_is_wake_not_start ... ok
2026-07-29T09:53:23.4186904Z test picker::model::tests::confirm_options_status_dependent ... ok
2026-07-29T09:53:23.4188359Z test picker::model::tests::confirm_terminal_routes ... ok
2026-07-29T09:53:23.4189619Z test picker::model::tests::confirm_terminal_wake_carries_raw_node ... ok
2026-07-29T09:53:23.4190908Z test picker::model::tests::create_new_multisubnet_inserts_home_layer ... ok
2026-07-29T09:53:23.4192086Z test picker::model::tests::create_outcome_bakes_run ... ok
2026-07-29T09:53:23.4193048Z test picker::model::tests::cursor_clamps ... ok
2026-07-29T09:53:23.4194216Z test picker::model::tests::display_mapping_matrix ... ok
2026-07-29T09:53:23.4195575Z test picker::model::tests::display_status_four_state_type_gated ... ok
2026-07-29T09:53:23.4196685Z test picker::model::tests::display_status_unbound_is_hollow_and_attachable ... ok
2026-07-29T09:53:23.4197971Z test picker::model::tests::empty_scope_opens_create ... ok
2026-07-29T09:53:23.4199298Z test picker::model::tests::ep_display_glyph_and_square_palette ... ok
2026-07-29T09:53:23.4200671Z test picker::model::tests::esc_backs_out_of_home_layer ... ok
2026-07-29T09:53:23.4203343Z test picker::model::tests::filter_narrows ... ok
2026-07-29T09:53:23.4204845Z test picker::model::tests::from_resource_row_maps_gossiped_adapter_projects_controlled ... ok
2026-07-29T09:53:23.4206173Z test picker::model::tests::home_selection_bakes_into_run_subnet ... ok
2026-07-29T09:53:23.4207188Z test picker::model::tests::kind_routes ... ok
2026-07-29T09:53:23.4208771Z test picker::model::tests::launch_keys_live_only_on_launch_capable_highlights ... ok
2026-07-29T09:53:23.4209888Z test picker::model::tests::prefill_jumps_to_create ... ok
2026-07-29T09:53:23.4211135Z test picker::model::tests::project_filter_keys_on_slug_while_tab_renders_display ... ok
2026-07-29T09:53:23.4212376Z test picker::model::tests::purge_confirm_yields_outcome_and_backs_out ... ok
2026-07-29T09:53:23.4213595Z test picker::model::tests::purge_shortcut_gates_to_offline_local ... ok
2026-07-29T09:53:23.4214831Z test picker::model::tests::reenter_create_keeps_or_clears_id ... ok
2026-07-29T09:53:23.4216184Z test picker::model::tests::remove_endpoint_drops_row_and_clamps_cursor ... ok
2026-07-29T09:53:23.4217453Z test picker::model::tests::resume_outcome_adapter_follows_recorded_row ... ok
2026-07-29T09:53:23.4218704Z test picker::model::tests::resume_outcome_bakes_session ... ok
2026-07-29T09:53:23.4221047Z test picker::model::tests::resume_title_render ... ok
2026-07-29T09:53:23.4222434Z test picker::model::tests::should_offer_project_choice_fire_conditions ... ok
2026-07-29T09:53:23.4223702Z test picker::model::tests::single_subnet_skips_home_layer ... ok
2026-07-29T09:53:23.4224832Z test picker::model::tests::suspended_is_distinct_from_offline ... ok
2026-07-29T09:53:23.4226104Z test picker::model::tests::visible_partitions_and_sorts ... ok
2026-07-29T09:53:23.4227878Z test picker::shortcut::tests::bakes_create_attach_by_default ... ok
2026-07-29T09:53:23.4229328Z test picker::shortcut::tests::bakes_resume_and_action ... ok
2026-07-29T09:53:23.4230772Z test picker::shortcut::tests::basename_is_parameterized ... ok
2026-07-29T09:53:23.4232424Z test picker::shortcut::tests::sentinel_detection ... ok
2026-07-29T09:53:23.4457418Z test picker::shortcut::tests::write_create_update_refuse ... ok
2026-07-29T09:53:23.4459135Z test picker::tests::backspace_backs_out_screens_like_esc ... ok
2026-07-29T09:53:23.4460612Z test picker::tests::backspace_stays_char_delete_in_text_contexts ... ok
2026-07-29T09:53:23.4461796Z test picker::tests::purge_outcomes_convert_to_flash_lines ... ok
2026-07-29T09:53:23.4518726Z test picker::tests::purge_transition_reconstructs_the_complete_screen_after_external_mutation ... ok
2026-07-29T09:53:23.4555128Z test picker::view::tests::adapter_tree_buffer ... ok
2026-07-29T09:53:23.4590311Z test picker::view::tests::change_adapter_screen_renders_tree_and_apply_legend ... ok
2026-07-29T09:53:23.4620523Z test picker::view::tests::choose_project_buffer_keeps_confirm_panel ... ok
2026-07-29T09:53:23.4665743Z test picker::view::tests::confirm_buffer_options ... ok
2026-07-29T09:53:23.4705168Z test picker::view::tests::confirm_fork_and_shortcut_labels_are_dir_relative ... ok
2026-07-29T09:53:23.4745597Z test picker::view::tests::confirm_panel_history_renders_display_not_slug ... ok
2026-07-29T09:53:23.4771362Z test picker::view::tests::create_home_lists_subnets ... ok
2026-07-29T09:53:23.4838264Z test picker::view::tests::footer_hints_h_s_only_when_launch_keys_live ... ok
2026-07-29T09:53:23.4862674Z test picker::view::tests::kind_buffer ... ok
2026-07-29T09:53:23.4909625Z test picker::view::tests::pick_buffer_has_squares_and_description ... ok
2026-07-29T09:53:23.4958036Z test picker::view::tests::pick_empty_category_hint ... ok
2026-07-29T09:53:23.5185704Z test picker::view::tests::pick_status_line_four_state ... ok
2026-07-29T09:53:23.5218430Z test picker::view::tests::resume_buffer_keeps_confirm_panel ... ok
2026-07-29T09:53:23.5258177Z test picker::view::tests::resume_buffer_lists_sessions ... ok
2026-07-29T09:53:34.5033053Z test cli::tests::shell_spawn_gates_on_the_registered_set ... ok
2026-07-29T09:53:34.5033926Z test rc::tests::attach_gate_routes_on_session_truth_not_the_row ... ok
2026-07-29T09:53:34.7096817Z test cli::tests::shell_spawn_profiled_option_resolves_and_shares_cap ... ok
2026-07-29T09:53:34.9017034Z test cli::tests::shutdown_and_stop_share_the_postcondition_and_differ_only_in_ceremony ... ok
2026-07-29T09:53:34.9018735Z test rc::tests::bracketed_paste_framing_is_exact_and_content_verbatim ... ok
2026-07-29T09:53:34.9021702Z test rc::tests::broker_host_child ... ok
2026-07-29T09:53:34.9023559Z test rc::tests::canonical_wire_id_strips_qualifiers_to_the_bare_id ... ok
2026-07-29T09:53:34.9024762Z test rc::tests::classify_read_err_eof_is_graceful_not_fatal ... ok
2026-07-29T09:53:34.9026555Z test rc::tests::clipboard_paste_wraps_nonempty_and_noops_on_empty_or_failure ... ok
2026-07-29T09:53:34.9028035Z test rc::tests::detach_keybind_semantics ... ok
2026-07-29T09:53:34.9029276Z test rc::tests::detach_prefix_spans_chunks ... ok
2026-07-29T09:53:34.9030760Z test rc::tests::display_guard_postlude_exactly_once_and_inactive_silent ... ok
2026-07-29T09:53:34.9032432Z test rc::tests::driver_phrase_names_own_node_plainly_but_remote_verbatim ... ok
2026-07-29T09:53:35.1690333Z test cli::tests::shutdown_on_a_broker_hosted_endpoint_stamps_after_the_reap ... ok
2026-07-29T09:53:35.1691008Z test rc::tests::first_event_stall_decision ... ok
2026-07-29T09:53:35.1691483Z test rc::tests::give_up_copy_names_daemon_down_vs_generic ... ok
2026-07-29T09:53:35.1692300Z test rc::tests::harness_only_row_matches_online_seatless_live_agents_only ... ok
2026-07-29T09:53:35.1692848Z test rc::tests::identity_line_format ... ok
2026-07-29T09:53:35.1694537Z test rc::tests::key_event_step_detach_sm ... ok
2026-07-29T09:53:35.1759421Z test rc::tests::mouse_is_paste_only_right_button_down ... ok
2026-07-29T09:53:35.1761100Z test rc::tests::mouse_mode_decset_scan_survives_split_across_chunks ... ok
2026-07-29T09:53:35.1761597Z test rc::tests::mouse_mode_decset_scan_tracks_enable_and_sgr ... ok
2026-07-29T09:53:35.1772136Z test rc::tests::op_minter_distinct_and_monotonic ... ok
2026-07-29T09:53:35.1777695Z test rc::tests::pre_broker_busy_guidance_fires_for_any_driver_not_just_remote ... ok
2026-07-29T09:53:35.1781279Z test rc::tests::public_attach_failure_maps_deadline_class_only ... ok
2026-07-29T09:53:35.1782939Z test rc::tests::pump_status_emit_sequence_over_write_sink ... ok
2026-07-29T09:53:35.2600126Z test cli::tests::shutdown_on_a_harness_hosted_endpoint_claims_no_process ... ok
2026-07-29T09:53:35.2601790Z test rc::tests::reassert_scanner_survives_split_across_chunks ... ok
2026-07-29T09:53:35.2602722Z test rc::tests::reassert_scanner_triggers_only_on_region_destroyers ... ok
2026-07-29T09:53:35.2604130Z test rc::tests::reconnect_banner_clears_and_centers ... ok
2026-07-29T09:53:35.2605363Z test rc::tests::reconnect_banner_shows_the_countdown ... ok
2026-07-29T09:53:35.2606607Z test rc::tests::reconnect_class_only_severed_transport_redrives ... ok
2026-07-29T09:53:35.2607906Z test rc::tests::reconnect_remaining_secs_counts_down_ceil ... ok
2026-07-29T09:53:35.2609160Z test rc::tests::reconnect_window_expiry_decision ... ok
2026-07-29T09:53:35.2610700Z test rc::tests::scroll_dir_classifies_wheel_only ... ok
2026-07-29T09:53:35.2611921Z test rc::tests::scroll_sgr_emits_exact_xterm_bytes ... ok
2026-07-29T09:53:35.2613103Z test rc::tests::serve_eof_severed_vs_refused ... ok
2026-07-29T09:53:35.2614539Z test rc::tests::status_assert_reserves_row1_then_repaints ... ok
2026-07-29T09:53:35.2615777Z test rc::tests::status_repaint_exact_bytes_and_right_align ... ok
2026-07-29T09:53:35.2617074Z test rc::tests::status_restore_exact_bytes ... ok
2026-07-29T09:53:35.2618348Z test rc::tests::status_row_marker_is_disabled_by_flag ... ok
2026-07-29T09:53:35.2619695Z test rc::tests::status_update_size_repoints_geometry ... ok
2026-07-29T09:53:35.2621386Z test rc::tests::teardown_matrix_postlude_precedes_prose_across_every_final_class ... ok
2026-07-29T09:53:35.2622752Z test rc::tests::translate_key_event_emits_exact_xterm_vt ... ok
2026-07-29T09:53:35.2623729Z test rc::tests::with_vt_output_disables_newline_auto_return ... ok
2026-07-29T09:53:35.2624748Z test rc::tests::with_vt_output_enables_virtual_terminal_processing ... ok
2026-07-29T09:53:35.4643052Z test cli::tests::spt_hosted_no_relay_detection ... ok
2026-07-29T09:53:35.5411475Z test picker::data::tests::gather_endpoints_projects_from_seeded_index_with_zero_git ... ok
2026-07-29T09:53:35.6151262Z test picker::data::tests::gather_renders_live_unbound ... ok
2026-07-29T09:53:36.0373111Z test picker::data::tests::home_subnet_options_is_mru_ordered ... ok
2026-07-29T09:53:36.0596742Z test picker::data::tests::own_node_tab_label_falls_back_to_keyprefix ... ok
2026-07-29T09:53:36.1671000Z test picker::data::tests::picker_excludes_flat_worker_and_psyche ... ok
2026-07-29T09:53:36.1884668Z test picker::data::tests::remote_picker_renders_suspended_dead_perch_offline ... ok
2026-07-29T09:53:36.1885922Z test roster::tests::match_self_by_ancestry_disambiguates_and_none ... ok
2026-07-29T09:53:36.2093640Z test picker::data::tests::remote_rows_render_full_palette_parity ... ok
2026-07-29T09:53:36.2094964Z test teardown::tests::an_unconfirmed_row_over_a_dead_root_is_stale_not_a_survivor ... ok
2026-07-29T09:53:36.2252521Z test picker::data::tests::resume_rows_title_from_index_cwd_map_with_pure_fallback ... ok
2026-07-29T09:53:36.2259174Z test teardown::tests::timeout_refuses_the_stamp_and_names_the_survivor ... ok
2026-07-29T09:53:36.2262055Z test teardown::tests::topology_gate_is_controllable_true_only ... ok
2026-07-29T09:53:36.2264152Z test tests::broken_pipe_panic_classifier ... ok
2026-07-29T09:53:36.2272189Z test wansend::tests::bare_id_resolves_across_remote_snapshot ... ok
2026-07-29T09:53:36.2278327Z test wansend::tests::classify_wan_reply_only_delivers_on_positive_outcomes ... ok
2026-07-29T09:53:36.2388910Z test wansend::tests::load_snapshots_degrades_on_junk ... ok
2026-07-29T09:53:36.2391455Z test wansend::tests::refusals_render_copy_paste_targets ... ok
2026-07-29T09:53:36.2433181Z test teardown::tests::liveness_proof_needs_a_real_snapshot_and_finds_this_process ... ok
2026-07-29T09:53:36.2455715Z test picker::data::tests::shared_machine_is_one_group_with_unioned_subnets ... ok
2026-07-29T09:53:36.2657696Z test rc::tests::attach_against_stopped_daemon_never_spawns_and_exits_loud ... ok
2026-07-29T09:53:36.3096134Z test rc::tests::attach_offline_endpoint_short_circuits_clean ... ok
2026-07-29T09:53:36.3250206Z 
2026-07-29T09:53:36.3250966Z running 1 test
2026-07-29T09:53:36.3578103Z NTP_TOTP_UNCORRECTED: all NTP servers unreachable — ceremony clock = raw system clock
2026-07-29T09:53:36.3699191Z CONN_LIFECYCLE: conn=1 role=brain wall_ms=1785318816369 mono_ms=0 event=transport-close poisoned=false timed_out=false [REQ-CONN-POISON-ATTRIBUTION]
2026-07-29T09:53:36.3700688Z CONN_LIFECYCLE: conn=3 role=brain wall_ms=1785318816370 mono_ms=0 event=write-start [REQ-CONN-POISON-ATTRIBUTION]
2026-07-29T09:53:36.4490351Z CONN_LIFECYCLE: conn=2 role=brain controller session=1 endpoint=reheal by=local wall_ms=1785318816448 mono_ms=79 event=controller-attach session=1 from_seq=0 [REQ-CONN-POISON-ATTRIBUTION]
2026-07-29T09:53:36.4500525Z CONN_LIFECYCLE: conn=2 role=brain controller session=1 endpoint=reheal by=local wall_ms=1785318816449 mono_ms=79 event=write-start [REQ-CONN-POISON-ATTRIBUTION]
2026-07-29T09:53:36.4510929Z CONN_LIFECYCLE: conn=4 role=brain wall_ms=1785318816450 mono_ms=81 event=write-start [REQ-CONN-POISON-ATTRIBUTION]
2026-07-29T09:53:36.4659925Z CONN_LIFECYCLE: conn=4 role=brain stream-subscriber stream=2 wall_ms=1785318816465 mono_ms=95 event=stream-sub-attach stream=2 from_seq=0 [REQ-CONN-POISON-ATTRIBUTION]
2026-07-29T09:53:36.4714997Z CONN_LIFECYCLE: conn=5 role=brain wall_ms=1785318816471 mono_ms=101 event=write-start [REQ-CONN-POISON-ATTRIBUTION]
2026-07-29T09:53:36.4716727Z CONN_LIFECYCLE: conn=5 role=brain wall_ms=1785318816471 mono_ms=101 event=transport-close poisoned=false timed_out=false [REQ-CONN-POISON-ATTRIBUTION]
2026-07-29T09:53:36.4721369Z CONN_LIFECYCLE: conn=6 role=brain wall_ms=1785318816472 mono_ms=102 event=write-start [REQ-CONN-POISON-ATTRIBUTION]
2026-07-29T09:53:36.4723879Z CONN_LIFECYCLE: conn=6 role=brain stream-subscriber stream=1 wall_ms=1785318816472 mono_ms=102 event=stream-sub-attach stream=1 from_seq=0 [REQ-CONN-POISON-ATTRIBUTION]
2026-07-29T09:53:36.4726864Z CONN_LIFECYCLE: conn=6 role=brain stream-subscriber stream=1 viewer session=1 endpoint=reheal vid=0 wall_ms=1785318816472 mono_ms=102 event=viewer-attach session=1 vid=0 from_seq=0 [REQ-CONN-POISON-ATTRIBUTION]
2026-07-29T09:53:36.4733649Z SUBSCRIBE_DECISION: session=1 endpoint=reheal by=fd1724385aa0c75b64fb78cd602fa1d991fdebf76b13c58ed702eac835e9f618 conn=6 intent=viewer old_by=- old_gen=0 req_gen=0 decision=viewer
2026-07-29T09:53:36.4735765Z CONN_LIFECYCLE: conn=6 role=brain stream-subscriber stream=1 viewer session=1 endpoint=reheal vid=0 viewer session=1 endpoint=reheal vid=1 wall_ms=1785318816472 mono_ms=103 event=viewer-attach session=1 vid=1 from_seq=0 [REQ-CONN-POISON-ATTRIBUTION]
2026-07-29T09:53:36.4737105Z SUBSCRIBE_DECISION: session=1 endpoint=reheal by=fd1724385aa0c75b64fb78cd602fa1d991fdebf76b13c58ed702eac835e9f618 conn=6 intent=viewer old_by=- old_gen=0 req_gen=0 decision=viewer
2026-07-29T09:53:36.6134321Z 
2026-07-29T09:53:36.6134900Z running 1 test
2026-07-29T09:53:36.6471197Z NTP_TOTP_UNCORRECTED: all NTP servers unreachable — ceremony clock = raw system clock
2026-07-29T09:53:36.6895764Z CONN_LIFECYCLE: conn=1 role=brain wall_ms=1785318816689 mono_ms=0 event=transport-close poisoned=false timed_out=false [REQ-CONN-POISON-ATTRIBUTION]
2026-07-29T09:53:36.6898269Z CONN_LIFECYCLE: conn=3 role=brain wall_ms=1785318816689 mono_ms=0 event=write-start [REQ-CONN-POISON-ATTRIBUTION]
2026-07-29T09:53:36.7226544Z CONN_LIFECYCLE: conn=2 role=brain controller session=1 endpoint=reheal by=local wall_ms=1785318816721 mono_ms=32 event=controller-attach session=1 from_seq=0 [REQ-CONN-POISON-ATTRIBUTION]
2026-07-29T09:53:36.7228638Z CONN_LIFECYCLE: conn=2 role=brain controller session=1 endpoint=reheal by=local wall_ms=1785318816722 mono_ms=32 event=write-start [REQ-CONN-POISON-ATTRIBUTION]
2026-07-29T09:53:37.5043093Z CONN_LIFECYCLE: conn=4 role=brain wall_ms=1785318817504 mono_ms=814 event=write-start [REQ-CONN-POISON-ATTRIBUTION]
2026-07-29T09:53:37.5185781Z CONN_LIFECYCLE: conn=4 role=brain stream-subscriber stream=2 wall_ms=1785318817518 mono_ms=828 event=stream-sub-attach stream=2 from_seq=0 [REQ-CONN-POISON-ATTRIBUTION]
2026-07-29T09:53:37.5472433Z CONN_LIFECYCLE: conn=5 role=brain wall_ms=1785318817547 mono_ms=857 event=write-start [REQ-CONN-POISON-ATTRIBUTION]
2026-07-29T09:53:37.5473369Z CONN_LIFECYCLE: conn=5 role=brain wall_ms=1785318817547 mono_ms=857 event=transport-close poisoned=false timed_out=false [REQ-CONN-POISON-ATTRIBUTION]
2026-07-29T09:53:37.5476373Z CONN_LIFECYCLE: conn=6 role=brain wall_ms=1785318817547 mono_ms=858 event=write-start [REQ-CONN-POISON-ATTRIBUTION]
2026-07-29T09:53:37.5478080Z CONN_LIFECYCLE: conn=6 role=brain stream-subscriber stream=1 wall_ms=1785318817547 mono_ms=858 event=stream-sub-attach stream=1 from_seq=0 [REQ-CONN-POISON-ATTRIBUTION]
2026-07-29T09:53:37.5479903Z CONN_LIFECYCLE: conn=6 role=brain stream-subscriber stream=1 viewer session=1 endpoint=reheal vid=0 wall_ms=1785318817547 mono_ms=858 event=viewer-attach session=1 vid=0 from_seq=0 [REQ-CONN-POISON-ATTRIBUTION]
2026-07-29T09:53:37.5482283Z SUBSCRIBE_DECISION: session=1 endpoint=reheal by=fd1724385aa0c75b64fb78cd602fa1d991fdebf76b13c58ed702eac835e9f618 conn=6 intent=viewer old_by=- old_gen=0 req_gen=0 decision=viewer
2026-07-29T09:53:37.5483398Z CONN_LIFECYCLE: conn=6 role=brain stream-subscriber stream=1 viewer session=1 endpoint=reheal vid=0 viewer session=1 endpoint=reheal vid=1 wall_ms=1785318817548 mono_ms=858 event=viewer-attach session=1 vid=1 from_seq=0 [REQ-CONN-POISON-ATTRIBUTION]
2026-07-29T09:53:37.5485063Z SUBSCRIBE_DECISION: session=1 endpoint=reheal by=fd1724385aa0c75b64fb78cd602fa1d991fdebf76b13c58ed702eac835e9f618 conn=6 intent=viewer old_by=- old_gen=0 req_gen=0 decision=viewer
2026-07-29T09:53:37.8834486Z CONN_LIFECYCLE: conn=6 role=brain stream-subscriber stream=1 viewer session=1 endpoint=reheal vid=0 viewer session=1 endpoint=reheal vid=1 wall_ms=1785318817883 mono_ms=1193 event=stream-sub-release stream=1 [REQ-CONN-POISON-ATTRIBUTION]
2026-07-29T09:53:37.8835959Z CONN_LIFECYCLE: conn=7 role=brain wall_ms=1785318817883 mono_ms=1193 event=transport-close poisoned=false timed_out=false [REQ-CONN-POISON-ATTRIBUTION]
2026-07-29T09:53:37.8958393Z test rc::tests::attach_viewport_reconnects_across_a_broker_bounce ... ok
2026-07-29T09:53:39.2224731Z test rc::tests::establish_attach_reuses_the_probes_carried_pump_conn ... ok
2026-07-29T09:53:41.5463424Z test rc::tests::qualified_targets_attach_with_bare_wire_id ... ok
2026-07-29T09:53:41.5669308Z test roster::tests::detect_self_by_ancestry_none_when_no_ancestor_owns_a_perch ... ok
2026-07-29T09:53:41.5940253Z test roster::tests::detect_self_by_ancestry_resolves_a_live_ancestor_perch ... ok
2026-07-29T09:53:41.6104140Z test roster::tests::detect_self_id_endpoint_id_leg_is_label_only_and_perch_gated ... ok
2026-07-29T09:53:41.6515556Z test roster::tests::detect_self_id_resolves_identity_with_zero_git_spawns ... ok
2026-07-29T09:53:41.6765528Z test roster::tests::detect_self_resolves_spt_hosted_perch_via_parent_pid ... ok
2026-07-29T09:53:41.6790415Z test roster::tests::enumerate_yields_offline_corrupt_row_for_unparseable_info ... ok
2026-07-29T09:53:41.7173464Z test roster::tests::list_all_perch_dirs_enumerates_nested_psyche_for_self_resolution ... ok
2026-07-29T09:53:41.7460329Z test roster::tests::parent_pid_candidates_stay_ancestry_gated ... ok
2026-07-29T09:53:42.1893256Z test wansend::tests::remote_rest_suspends_and_wakes_with_the_deferred_gate ... ok
2026-07-29T09:53:42.2677270Z test wansend::tests::resolve_and_dial_owner_dials_the_resolved_node ... ok
2026-07-29T09:53:42.3200099Z test wansend::tests::resolve_and_dial_owner_is_honest_on_resolution_misses ... ok
2026-07-29T09:53:42.3339252Z test wansend::tests::seed_first_addr_prefers_the_cached_direct_address ... ok
2026-07-29T09:53:42.5799080Z test wansend::tests::wan_send_ships_to_the_resolved_node ... ok
2026-07-29T09:53:42.5799395Z 
2026-07-29T09:53:42.5799678Z failures:
2026-07-29T09:53:42.5799778Z 
2026-07-29T09:53:42.5799967Z ---- cli::tests::adapter_translate_proof_gates_on_commit stdout ----
2026-07-29T09:53:42.5800272Z 
2026-07-29T09:53:42.5800588Z thread 'cli::tests::adapter_translate_proof_gates_on_commit' (21380) panicked at crates\spt\src\cli.rs:17011:13:
2026-07-29T09:53:42.5805001Z translate_proof_fixture must be built: C:\actions-runner\_work\spt-bs-core\spt-bs-core\target\debug\translate_proof_fixture.exe (run via `cargo test -p spt`)
2026-07-29T09:53:42.5805832Z note: run with `RUST_BACKTRACE=1` environment variable to display a backtrace
2026-07-29T09:53:42.5806029Z 
2026-07-29T09:53:42.5806033Z 
2026-07-29T09:53:42.5806077Z failures:
2026-07-29T09:53:42.5806236Z     cli::tests::adapter_translate_proof_gates_on_commit
2026-07-29T09:53:42.5806607Z 
2026-07-29T09:53:42.5806916Z test result: FAILED. 456 passed; 1 failed; 0 ignored; 0 measured; 0 filtered out; finished in 53.63s
2026-07-29T09:53:42.5807319Z 
2026-07-29T09:53:42.6035319Z error: test failed, to rerun pass `-p spt --bin spt`
2026-07-29T09:53:42.6873819Z ##[error]Process completed with exit code 1.
